{"text_format":"1","workbook":"xlsx","n_sheets":13,"sheets":["Inicio","Participantes","Obj Esp","Actividades","Año 1 E1","Etapa 1","Año 3 E1","Etapa 2","Etapa 3","Etapa 1 x Act","Áreas Desarrollo","Tablas Resumen","Listas"],"not_rendered":{"charts":0,"images":1,"macros":1,"external_links":0,"defined_names":17,"comments":1,"pivot_tables":0},"unopened":[],"bounds":{"document_bytes":16777216,"sheet_cells":100000,"rows_first":2000,"rows_last":500,"rows_between":2000,"halvings":0,"cell_chars":16384,"cell_head_chars":4096},"cells_cut":0,"cells_raw":0,"read":"whole","date_system":"1900"}

{"sheet":"Inicio","index":0,"n_rows":9,"n_cols":2,"rows_kept":9,"cut":false,"hidden":false,"merged":[[8,1,8,7]]}
[null,"Inicio"]
[null,"Presupuesto Centros Tecnológicos para la Innovación - Alcance Nacional"]
[null,"Instrucciones Generales:"]
[null,"1. Habilite las macros del documento. Haga clic en el boton \"Habilitar contenido\". Imagen ejemplo ->"]
[null,"2. Haga clic en las siguientes secciones para comenzar a ingresar el presupuesto del proyecto en Millones de pesos (MM$)."]
[null,"3. Para ingresar el presupuesto relacionado a una Entidad Participante éstas deben estár previamente identificadas."]
[]
[null,"Nombre del Proyecto:"]
[null,"Escriba el nombre del proyecto postulado…"]

{"sheet":"Participantes","index":1,"n_rows":86,"n_cols":6,"rows_kept":86,"cut":false,"hidden":false,"merged":[]}
["Nombre de la Entidad Participante / Fuente de Financiamiento","Tipo",null,null,"Debe hacer clic en el botón \"Ordenar Participantes\" para ordenarlos por TIPO."]
["Corfo","Corfo",{"$f":"IF(A2>0,IF(B2>0,\" \",\"<<<  seleccionar tipo de entidad\"),IF(B2>0,IF(A2>0,\" \",\"<<<  escriba el nombre de la entidad\"),\" \"))","v":" "},null,null,{"$f":"+A2","v":"Corfo"}]
[null,null," ",null,null,0]
[null,null," ",null,null,0]
[null,null," ",null,null,0]
[null,null," ",null,null,0]
[null,null," ",null,null,0]
[null,null," ",null,null,0]
[null,null," ",null,null,0]
[null,null," ",null,null,0]
[null,null," ",null,null,0]
[null,null," ",null,null,0]
[null,null," ",null,null,0]
[null,null," ",null,null,0]
[null,null," ",null,null,0]
[null,null," ",null,null,0]
[null,null," ",null,null,0]
[null,null," ",null,null,0]
[null,null," ",null,null,0]
[null,null," ",null,null,0]
[null,null," ",null,null,0]
[null,null," ",null,null,0]
[null,null," ",null,null,0]
[null,null," ",null,null,0]
[null,null," ",null,null,0]
[null,null," ",null,null,0]
[null,null," ",null,null,0]
[null,null," ",null,null,0]
[null,null," ",null,null,0]
[null,null," ",null,null,0]
[null,null,{"$f":"IF(A31>0,IF(B31>0,\" \",\"<<<  seleccionar tipo de entidad\"),IF(B31>0,IF(A31>0,\" \",\"<<<  escriba el nombre de la entidad\"),\" \"))","v":" "},null,null,0]
[null,null," ",null,null,0]
[null,null," ",null,null,0]
[null,null," ",null,null,{"$f":"+A34","v":0}]
[null,null," ",null,null,0]
[null,null," ",null,null,0]
[null,null," ",null,null,0]
[null,null," ",null,null,0]
[null,null," ",null,null,0]
[null,null," ",null,null,0]
[null,null," ",null,null,0]
[null,null," ",null,null,0]
[null,null," ",null,null,0]
[null,null," ",null,null,0]
[null,null," ",null,null,0]
[null,null," ",null,null,0]
[null,null," ",null,null,0]
[null,null," ",null,null,0]
[null,null," ",null,null,0]
[null,null," ",null,null,0]
[null,null," ",null,null,0]
[null,null," ",null,null,0]
[null,null," ",null,null,0]
[null,null," ",null,null,0]
[null,null," ",null,null,0]
[null,null," ",null,null,0]
[null,null," ",null,null,0]
[null,null," ",null,null,0]
[null,null," ",null,null,0]
[null,null," ",null,null,0]
[null,null," ",null,null,0]
[null,null," ",null,null,0]
[null,null," ",null,null,0]
[null,null," ",null,null,0]
[null,null," ",null,null,0]
[null,null," ",null,null,{"$f":"+A66","v":0}]
[null,null,{"$f":"IF(A67>0,IF(B67>0,\" \",\"<<<  seleccionar tipo de entidad\"),IF(B67>0,IF(A67>0,\" \",\"<<<  escriba el nombre de la entidad\"),\" \"))","v":" "},null,null,0]
[null,null," ",null,null,0]
[null,null," ",null,null,0]
[null,null," ",null,null,0]
[null,null," ",null,null,0]
[null,null," ",null,null,0]
[null,null," ",null,null,0]
[null,null," ",null,null,0]
[null,null," ",null,null,0]
[null,null," ",null,null,0]
[null,null," ",null,null,0]
[null,null," ",null,null,0]
[null,null," ",null,null,0]
[null,null," ",null,null,0]
[null,null," ",null,null,0]
[null,null," ",null,null,0]
[null,null," ",null,null,0]
[null,null," ",null,null,0]
[null,null," ",null,null,0]
[null,null," ",null,null,0]

{"sheet":"Obj Esp","index":2,"n_rows":15,"n_cols":4,"rows_kept":15,"cut":false,"hidden":true,"merged":[]}
["Objetivos Específicos del Proyecto"]
["Los objetivos específicos deberán ser los mismos que se indiquen en el formulario de postulación."]
[]
["Nº","Objetivos Específicos","Obj Esp","#"]
["Obj. G. ","Actividad asociada a más de un Objetivo Específico",{"$f":"CONCATENATE(A5,B5)","v":"Obj. G. Actividad asociada a más de un Objetivo Específico"},{"$f":"+A5","v":"Obj. G. "}]
["01. ",null,"01. ",{"$f":"+A6","v":"01. "}]
["02. ",null,"02. ",{"$f":"+A7","v":"02. "}]
["03. ",null,"03. ","03. "]
["04. ",null,"04. ","04. "]
["05. ",null,"05. ","05. "]
["06. ",null,"06. ","06. "]
["07. ",null,"07. ","07. "]
["08. ",null,"08. ","08. "]
["09. ",null,"09. ","09. "]
["10. ",null,"10. ","10. "]

{"sheet":"Actividades","index":3,"n_rows":2177,"n_cols":4,"rows_kept":2177,"cut":false,"hidden":true,"merged":[]}
["Actividades Etapa 1"]
["1. Las actividades asociadas a cada objetivo específico deben ser las mismas indicadas en la Carta Gantt del proyecto."]
["2. En caso de actividades que exedan el tiempo de duración de la Etapa 1, si bien deberá escribirla en la lista, más adelante solo deberá presupuestar lo correspondiente a la Etapa 1."]
["3. Si la actividad esta relacionada a más de un objetivo específico, en la columna \"A\" seleccione \"Obj. G. Actividad asociada a más de un Objetivo Específico\"."]
[]
["Objetivos Específicos","Actividades","num obj"]
[null,"Nombre de la actividad asociada al objetivo específico 1…",{"$f":"VLOOKUP(A7,matriz_obj,2,FALSE)","v":{"$error":"#N/A"}},{"$f":"IF(B7>0,IF(A7>0,\" \",\"Seleccione el Objetivo Específico Asociado\"),\" \")","v":"Seleccione el Objetivo Específico Asociado"}]
[null,"etc…",{"$error":"#N/A"},"Seleccione el Objetivo Específico Asociado"]
[null,"etc…",{"$error":"#N/A"},"Seleccione el Objetivo Específico Asociado"]
[null,"Nombre de la actividad asociada al objetivo específico 2…",{"$error":"#N/A"},"Seleccione el Objetivo Específico Asociado"]
[null,"etc…",{"$error":"#N/A"},"Seleccione el Objetivo Específico Asociado"]
[null,"etc…",{"$error":"#N/A"},"Seleccione el Objetivo Específico Asociado"]
[null,"etc…",{"$error":"#N/A"},"Seleccione el Objetivo Específico Asociado"]
[null,"etc…",{"$error":"#N/A"},"Seleccione el Objetivo Específico Asociado"]
[null,"Nombre de la actividad asociada al objetivo específico 3…",{"$error":"#N/A"},"Seleccione el Objetivo Específico Asociado"]
[null,"etc…",{"$error":"#N/A"},"Seleccione el Objetivo Específico Asociado"]
[null,"etc…",{"$error":"#N/A"},"Seleccione el Objetivo Específico Asociado"]
[null,"etc…",{"$error":"#N/A"},"Seleccione el Objetivo Específico Asociado"]
[null,"etc…",{"$error":"#N/A"},"Seleccione el Objetivo Específico Asociado"]
[null,"etc…",{"$error":"#N/A"},"Seleccione el Objetivo Específico Asociado"]
[null,"etc…",{"$error":"#N/A"},"Seleccione el Objetivo Específico Asociado"]
[null,null,{"$error":"#N/A"}," "]
[null,null,{"$error":"#N/A"}," "]
[null,null,{"$error":"#N/A"}," "]
[null,null,{"$error":"#N/A"}," "]
[null,null,{"$error":"#N/A"}," "]
[null,null,{"$error":"#N/A"}," "]
[null,null,{"$error":"#N/A"}," "]
[null,null,{"$error":"#N/A"}," "]
[null,null,{"$error":"#N/A"}," "]
[null,null,{"$error":"#N/A"}," "]
[null,null,{"$error":"#N/A"}," "]
[null,null,{"$error":"#N/A"}," "]
[null,null,{"$error":"#N/A"}," "]
[null,null,{"$error":"#N/A"}," "]
[null,null,{"$error":"#N/A"}," "]
[null,null,{"$error":"#N/A"}," "]
[null,null,{"$error":"#N/A"}," "]
[null,null,{"$error":"#N/A"}," "]
[null,null,{"$error":"#N/A"}," "]
[null,null,{"$error":"#N/A"}," "]
[null,null,{"$error":"#N/A"}," "]
[null,null,{"$error":"#N/A"}," "]
[null,null,{"$error":"#N/A"}," "]
[null,null,{"$error":"#N/A"}," "]
[null,null,{"$error":"#N/A"}," "]
[null,null,{"$error":"#N/A"}," "]
[null,null,{"$error":"#N/A"}," "]
[null,null,{"$error":"#N/A"}," "]
[null,null,{"$error":"#N/A"}," "]
[null,null,{"$error":"#N/A"}," "]
[null,null,{"$error":"#N/A"}," "]
[null,null,{"$error":"#N/A"}," "]
[null,null,{"$error":"#N/A"}," "]
[null,null,{"$error":"#N/A"}," "]
[null,null,{"$error":"#N/A"}," "]
[null,null,{"$error":"#N/A"}," "]
[null,null,{"$error":"#N/A"}," "]
[null,null,{"$error":"#N/A"}," "]
[null,null,{"$error":"#N/A"}," "]
[null,null,{"$error":"#N/A"}," "]
[null,null,{"$error":"#N/A"}," "]
[null,null,{"$error":"#N/A"}," "]
[null,null,{"$error":"#N/A"}," "]
[null,null,{"$error":"#N/A"}," "]
[null,null,{"$error":"#N/A"}," "]
[null,null,{"$error":"#N/A"}," "]
[null,null,{"$error":"#N/A"}," "]
[null,null,{"$error":"#N/A"}," "]
[null,null,{"$error":"#N/A"}," "]
[null,null,{"$f":"VLOOKUP(A71,matriz_obj,2,FALSE)","v":{"$error":"#N/A"}},{"$f":"IF(B71>0,IF(A71>0,\" \",\"Seleccione el Objetivo Específico Asociado\"),\" \")","v":" "}]
[null,null,{"$error":"#N/A"}," "]
[null,null,{"$error":"#N/A"}," "]
[null,null,{"$error":"#N/A"}," "]
[null,null,{"$error":"#N/A"}," "]
[null,null,{"$error":"#N/A"}," "]
[null,null,{"$error":"#N/A"}," "]
[null,null,{"$error":"#N/A"}," "]
[null,null,{"$error":"#N/A"}," "]
[null,null,{"$error":"#N/A"}," "]
[null,null,{"$error":"#N/A"}," "]
[null,null,{"$error":"#N/A"}," "]
[null,null,{"$error":"#N/A"}," "]
[null,null,{"$error":"#N/A"}," "]
[null,null,{"$error":"#N/A"}," "]
[null,null,{"$error":"#N/A"}," "]
[null,null,{"$error":"#N/A"}," "]
[null,null,{"$error":"#N/A"}," "]
[null,null,{"$error":"#N/A"}," "]
[null,null,{"$error":"#N/A"}," "]
[null,null,{"$error":"#N/A"}," "]
[null,null,{"$error":"#N/A"}," "]
[null,null,{"$error":"#N/A"}," "]
[null,null,{"$error":"#N/A"}," "]
[null,null,{"$error":"#N/A"}," "]
[null,null,{"$error":"#N/A"}," "]
[null,null,{"$error":"#N/A"}," "]
[null,null,{"$error":"#N/A"}," "]
[null,null,{"$error":"#N/A"}," "]
[null,null,{"$error":"#N/A"}," "]
[null,null,{"$error":"#N/A"}," "]
[null,null,{"$error":"#N/A"}," "]
[null,null,{"$error":"#N/A"}," "]
[null,null,{"$error":"#N/A"}," "]
[null,null,{"$error":"#N/A"}," "]
[null,null,{"$error":"#N/A"}," "]
[null,null,{"$error":"#N/A"}," "]
[null,null,{"$error":"#N/A"}," "]
[null,null,{"$error":"#N/A"}," "]
[null,null,{"$error":"#N/A"}," "]
[null,null,{"$error":"#N/A"}," "]
[null,null,{"$error":"#N/A"}," "]
[null,null,{"$error":"#N/A"}," "]
[null,null,{"$error":"#N/A"}," "]
[null,null,{"$error":"#N/A"}," "]
[null,null,{"$error":"#N/A"}," "]
[null,null,{"$error":"#N/A"}," "]
[null,null,{"$error":"#N/A"}," "]
[null,null,{"$error":"#N/A"}," "]
[null,null,{"$error":"#N/A"}," "]
[null,null,{"$error":"#N/A"}," "]
[null,null,{"$error":"#N/A"}," "]
[null,null,{"$error":"#N/A"}," "]
[null,null,{"$error":"#N/A"}," "]
[null,null,{"$error":"#N/A"}," "]
[null,null,{"$error":"#N/A"}," "]
[null,null,{"$error":"#N/A"}," "]
[null,null,{"$error":"#N/A"}," "]
[null,null,{"$error":"#N/A"}," "]
[null,null,{"$error":"#N/A"}," "]
[null,null,{"$error":"#N/A"}," "]
[null,null,{"$error":"#N/A"}," "]
[null,null,{"$error":"#N/A"}," "]
[null,null,{"$error":"#N/A"}," "]
[null,null,{"$f":"VLOOKUP(A135,matriz_obj,2,FALSE)","v":{"$error":"#N/A"}},{"$f":"IF(B135>0,IF(A135>0,\" \",\"Seleccione el Objetivo Específico Asociado\"),\" \")","v":" "}]
[null,null,{"$error":"#N/A"}," "]
[null,null,{"$error":"#N/A"}," "]
[null,null,{"$error":"#N/A"}," "]
[null,null,{"$error":"#N/A"}," "]
[null,null,{"$error":"#N/A"}," "]
[null,null,{"$error":"#N/A"}," "]
[null,null,{"$error":"#N/A"}," "]
[null,null,{"$error":"#N/A"}," "]
[null,null,{"$error":"#N/A"}," "]
[null,null,{"$error":"#N/A"}," "]
[null,null,{"$error":"#N/A"}," "]
[null,null,{"$error":"#N/A"}," "]
[null,null,{"$error":"#N/A"}," "]
[null,null,{"$error":"#N/A"}," "]
[null,null,{"$error":"#N/A"}," "]
[null,null,{"$error":"#N/A"}," "]
[null,null,{"$error":"#N/A"}," "]
[null,null,{"$error":"#N/A"}," "]
[null,null,{"$error":"#N/A"}," "]
[null,null,{"$error":"#N/A"}," "]
[null,null,{"$error":"#N/A"}," "]
[null,null,{"$error":"#N/A"}," "]
[null,null,{"$error":"#N/A"}," "]
[null,null,{"$error":"#N/A"}," "]
[null,null,{"$error":"#N/A"}," "]
[null,null,{"$error":"#N/A"}," "]
[null,null,{"$error":"#N/A"}," "]
[null,null,{"$error":"#N/A"}," "]
[null,null,{"$error":"#N/A"}," "]
[null,null,{"$error":"#N/A"}," "]
[null,null,{"$error":"#N/A"}," "]
[null,null,{"$error":"#N/A"}," "]
[null,null,{"$error":"#N/A"}," "]
[null,null,{"$error":"#N/A"}," "]
[null,null,{"$error":"#N/A"}," "]
[null,null,{"$error":"#N/A"}," "]
[null,null,{"$error":"#N/A"}," "]
[null,null,{"$error":"#N/A"}," "]
[null,null,{"$error":"#N/A"}," "]
[null,null,{"$error":"#N/A"}," "]
[null,null,{"$error":"#N/A"}," "]
[null,null,{"$error":"#N/A"}," "]
[null,null,{"$error":"#N/A"}," "]
[null,null,{"$error":"#N/A"}," "]
[null,null,{"$error":"#N/A"}," "]
[null,null,{"$error":"#N/A"}," "]
[null,null,{"$error":"#N/A"}," "]
[null,null,{"$error":"#N/A"}," "]
[null,null,{"$error":"#N/A"}," "]
[null,null,{"$error":"#N/A"}," "]
[null,null,{"$error":"#N/A"}," "]
[null,null,{"$error":"#N/A"}," "]
[null,null,{"$error":"#N/A"}," "]
[null,null,{"$error":"#N/A"}," "]
[null,null,{"$error":"#N/A"}," "]
[null,null,{"$error":"#N/A"}," "]
[null,null,{"$error":"#N/A"}," "]
[null,null,{"$error":"#N/A"}," "]
[null,null,{"$error":"#N/A"}," "]
[null,null,{"$error":"#N/A"}," "]
[null,null,{"$error":"#N/A"}," "]
[null,null,{"$error":"#N/A"}," "]
[null,null,{"$error":"#N/A"}," "]
[null,null,{"$f":"VLOOKUP(A199,matriz_obj,2,FALSE)","v":{"$error":"#N/A"}},{"$f":"IF(B199>0,IF(A199>0,\" \",\"Seleccione el Objetivo Específico Asociado\"),\" \")","v":" "}]
[null,null,{"$error":"#N/A"}," "]
[null,null,{"$error":"#N/A"}," "]
[null,null,{"$error":"#N/A"}," "]
[null,null,{"$error":"#N/A"}," "]
[null,null,{"$error":"#N/A"}," "]
[null,null,{"$error":"#N/A"}," "]
[null,null,{"$error":"#N/A"}," "]
[null,null,{"$error":"#N/A"}," "]
[null,null,{"$error":"#N/A"}," "]
[null,null,{"$error":"#N/A"}," "]
[null,null,{"$error":"#N/A"}," "]
[null,null,{"$error":"#N/A"}," "]
[null,null,{"$error":"#N/A"}," "]
[null,null,{"$error":"#N/A"}," "]
[null,null,{"$error":"#N/A"}," "]
[null,null,{"$error":"#N/A"}," "]
[null,null,{"$error":"#N/A"}," "]
[null,null,{"$error":"#N/A"}," "]
[null,null,{"$error":"#N/A"}," "]
[null,null,{"$error":"#N/A"}," "]
[null,null,{"$error":"#N/A"}," "]
[null,null,{"$error":"#N/A"}," "]
[null,null,{"$error":"#N/A"}," "]
[null,null,{"$error":"#N/A"}," "]
[null,null,{"$error":"#N/A"}," "]
[null,null,{"$error":"#N/A"}," "]
[null,null,{"$error":"#N/A"}," "]
[null,null,{"$error":"#N/A"}," "]
[null,null,{"$error":"#N/A"}," "]
[null,null,{"$error":"#N/A"}," "]
[null,null,{"$error":"#N/A"}," "]
[null,null,{"$error":"#N/A"}," "]
[null,null,{"$error":"#N/A"}," "]
[null,null,{"$error":"#N/A"}," "]
[null,null,{"$error":"#N/A"}," "]
[null,null,{"$error":"#N/A"}," "]
[null,null,{"$error":"#N/A"}," "]
[null,null,{"$error":"#N/A"}," "]
[null,null,{"$error":"#N/A"}," "]
[null,null,{"$error":"#N/A"}," "]
[null,null,{"$error":"#N/A"}," "]
[null,null,{"$error":"#N/A"}," "]
[null,null,{"$error":"#N/A"}," "]
[null,null,{"$error":"#N/A"}," "]
[null,null,{"$error":"#N/A"}," "]
[null,null,{"$error":"#N/A"}," "]
[null,null,{"$error":"#N/A"}," "]
[null,null,{"$error":"#N/A"}," "]
[null,null,{"$error":"#N/A"}," "]
[null,null,{"$error":"#N/A"}," "]
[null,null,{"$error":"#N/A"}," "]
[null,null,{"$error":"#N/A"}," "]
[null,null,{"$error":"#N/A"}," "]
[null,null,{"$error":"#N/A"}," "]
[null,null,{"$error":"#N/A"}," "]
[null,null,{"$error":"#N/A"}," "]
[null,null,{"$error":"#N/A"}," "]
[null,null,{"$error":"#N/A"}," "]
[null,null,{"$error":"#N/A"}," "]
[null,null,{"$error":"#N/A"}," "]
[null,null,{"$error":"#N/A"}," "]
[null,null,{"$error":"#N/A"}," "]
[null,null,{"$error":"#N/A"}," "]
[null,null,{"$f":"VLOOKUP(A263,matriz_obj,2,FALSE)","v":{"$error":"#N/A"}},{"$f":"IF(B263>0,IF(A263>0,\" \",\"Seleccione el Objetivo Específico Asociado\"),\" \")","v":" "}]
[null,null,{"$error":"#N/A"}," "]
[null,null,{"$error":"#N/A"}," "]
[null,null,{"$error":"#N/A"}," "]
[null,null,{"$error":"#N/A"}," "]
[null,null,{"$error":"#N/A"}," "]
[null,null,{"$error":"#N/A"}," "]
[null,null,{"$error":"#N/A"}," "]
[null,null,{"$error":"#N/A"}," "]
[null,null,{"$error":"#N/A"}," "]
[null,null,{"$error":"#N/A"}," "]
[null,null,{"$error":"#N/A"}," "]
[null,null,{"$error":"#N/A"}," "]
[null,null,{"$error":"#N/A"}," "]
[null,null,{"$error":"#N/A"}," "]
[null,null,{"$error":"#N/A"}," "]
[null,null,{"$error":"#N/A"}," "]
[null,null,{"$error":"#N/A"}," "]
[null,null,{"$error":"#N/A"}," "]
[null,null,{"$error":"#N/A"}," "]
[null,null,{"$error":"#N/A"}," "]
[null,null,{"$error":"#N/A"}," "]
[null,null,{"$error":"#N/A"}," "]
[null,null,{"$error":"#N/A"}," "]
[null,null,{"$error":"#N/A"}," "]
[null,null,{"$error":"#N/A"}," "]
[null,null,{"$error":"#N/A"}," "]
[null,null,{"$error":"#N/A"}," "]
[null,null,{"$error":"#N/A"}," "]
[null,null,{"$error":"#N/A"}," "]
[null,null,{"$error":"#N/A"}," "]
[null,null,{"$error":"#N/A"}," "]
[null,null,{"$error":"#N/A"}," "]
[null,null,{"$error":"#N/A"}," "]
[null,null,{"$error":"#N/A"}," "]
[null,null,{"$error":"#N/A"}," "]
[null,null,{"$error":"#N/A"}," "]
[null,null,{"$error":"#N/A"}," "]
[null,null,{"$error":"#N/A"}," "]
[null,null,{"$error":"#N/A"}," "]
[null,null,{"$error":"#N/A"}," "]
[null,null,{"$error":"#N/A"}," "]
[null,null,{"$error":"#N/A"}," "]
[null,null,{"$error":"#N/A"}," "]
[null,null,{"$error":"#N/A"}," "]
[null,null,{"$error":"#N/A"}," "]
[null,null,{"$error":"#N/A"}," "]
[null,null,{"$error":"#N/A"}," "]
[null,null,{"$error":"#N/A"}," "]
[null,null,{"$error":"#N/A"}," "]
[null,null,{"$error":"#N/A"}," "]
[null,null,{"$error":"#N/A"}," "]
[null,null,{"$error":"#N/A"}," "]
[null,null,{"$error":"#N/A"}," "]
[null,null,{"$error":"#N/A"}," "]
[null,null,{"$error":"#N/A"}," "]
[null,null,{"$error":"#N/A"}," "]
[null,null,{"$error":"#N/A"}," "]
[null,null,{"$error":"#N/A"}," "]
[null,null,{"$error":"#N/A"}," "]
[null,null,{"$error":"#N/A"}," "]
[null,null,{"$error":"#N/A"}," "]
[null,null,{"$error":"#N/A"}," "]
[null,null,{"$error":"#N/A"}," "]
[null,null,{"$f":"VLOOKUP(A327,matriz_obj,2,FALSE)","v":{"$error":"#N/A"}},{"$f":"IF(B327>0,IF(A327>0,\" \",\"Seleccione el Objetivo Específico Asociado\"),\" \")","v":" "}]
[null,null,{"$error":"#N/A"}," "]
[null,null,{"$error":"#N/A"}," "]
[null,null,{"$error":"#N/A"}," "]
[null,null,{"$error":"#N/A"}," "]
[null,null,{"$error":"#N/A"}," "]
[null,null,{"$error":"#N/A"}," "]
[null,null,{"$error":"#N/A"}," "]
[null,null,{"$error":"#N/A"}," "]
[null,null,{"$error":"#N/A"}," "]
[null,null,{"$error":"#N/A"}," "]
[null,null,{"$error":"#N/A"}," "]
[null,null,{"$error":"#N/A"}," "]
[null,null,{"$error":"#N/A"}," "]
[null,null,{"$error":"#N/A"}," "]
[null,null,{"$error":"#N/A"}," "]
[null,null,{"$error":"#N/A"}," "]
[null,null,{"$error":"#N/A"}," "]
[null,null,{"$error":"#N/A"}," "]
[null,null,{"$error":"#N/A"}," "]
[null,null,{"$error":"#N/A"}," "]
[null,null,{"$error":"#N/A"}," "]
[null,null,{"$error":"#N/A"}," "]
[null,null,{"$error":"#N/A"}," "]
[null,null,{"$error":"#N/A"}," "]
[null,null,{"$error":"#N/A"}," "]
[null,null,{"$error":"#N/A"}," "]
[null,null,{"$error":"#N/A"}," "]
[null,null,{"$error":"#N/A"}," "]
[null,null,{"$error":"#N/A"}," "]
[null,null,{"$error":"#N/A"}," "]
[null,null,{"$error":"#N/A"}," "]
[null,null,{"$error":"#N/A"}," "]
[null,null,{"$error":"#N/A"}," "]
[null,null,{"$error":"#N/A"}," "]
[null,null,{"$error":"#N/A"}," "]
[null,null,{"$error":"#N/A"}," "]
[null,null,{"$error":"#N/A"}," "]
[null,null,{"$error":"#N/A"}," "]
[null,null,{"$error":"#N/A"}," "]
[null,null,{"$error":"#N/A"}," "]
[null,null,{"$error":"#N/A"}," "]
[null,null,{"$error":"#N/A"}," "]
[null,null,{"$error":"#N/A"}," "]
[null,null,{"$error":"#N/A"}," "]
[null,null,{"$error":"#N/A"}," "]
[null,null,{"$error":"#N/A"}," "]
[null,null,{"$error":"#N/A"}," "]
[null,null,{"$error":"#N/A"}," "]
[null,null,{"$error":"#N/A"}," "]
[null,null,{"$error":"#N/A"}," "]
[null,null,{"$error":"#N/A"}," "]
[null,null,{"$error":"#N/A"}," "]
[null,null,{"$error":"#N/A"}," "]
[null,null,{"$error":"#N/A"}," "]
[null,null,{"$error":"#N/A"}," "]
[null,null,{"$error":"#N/A"}," "]
[null,null,{"$error":"#N/A"}," "]
[null,null,{"$error":"#N/A"}," "]
[null,null,{"$error":"#N/A"}," "]
[null,null,{"$error":"#N/A"}," "]
[null,null,{"$error":"#N/A"}," "]
[null,null,{"$error":"#N/A"}," "]
[null,null,{"$error":"#N/A"}," "]
[null,null,{"$f":"VLOOKUP(A391,matriz_obj,2,FALSE)","v":{"$error":"#N/A"}},{"$f":"IF(B391>0,IF(A391>0,\" \",\"Seleccione el Objetivo Específico Asociado\"),\" \")","v":" "}]
[null,null,{"$error":"#N/A"}," "]
[null,null,{"$error":"#N/A"}," "]
[null,null,{"$error":"#N/A"}," "]
[null,null,{"$error":"#N/A"}," "]
[null,null,{"$error":"#N/A"}," "]
[null,null,{"$error":"#N/A"}," "]
[null,null,{"$error":"#N/A"}," "]
[null,null,{"$error":"#N/A"}," "]
[null,null,{"$error":"#N/A"}," "]
[null,null,{"$error":"#N/A"}," "]
[null,null,{"$error":"#N/A"}," "]
[null,null,{"$error":"#N/A"}," "]
[null,null,{"$error":"#N/A"}," "]
[null,null,{"$error":"#N/A"}," "]
[null,null,{"$error":"#N/A"}," "]
[null,null,{"$error":"#N/A"}," "]
[null,null,{"$error":"#N/A"}," "]
[null,null,{"$error":"#N/A"}," "]
[null,null,{"$error":"#N/A"}," "]
[null,null,{"$error":"#N/A"}," "]
[null,null,{"$error":"#N/A"}," "]
[null,null,{"$error":"#N/A"}," "]
[null,null,{"$error":"#N/A"}," "]
[null,null,{"$error":"#N/A"}," "]
[null,null,{"$error":"#N/A"}," "]
[null,null,{"$error":"#N/A"}," "]
[null,null,{"$error":"#N/A"}," "]
[null,null,{"$error":"#N/A"}," "]
[null,null,{"$error":"#N/A"}," "]
[null,null,{"$error":"#N/A"}," "]
[null,null,{"$error":"#N/A"}," "]
[null,null,{"$error":"#N/A"}," "]
[null,null,{"$error":"#N/A"}," "]
[null,null,{"$error":"#N/A"}," "]
[null,null,{"$error":"#N/A"}," "]
[null,null,{"$error":"#N/A"}," "]
[null,null,{"$error":"#N/A"}," "]
[null,null,{"$error":"#N/A"}," "]
[null,null,{"$error":"#N/A"}," "]
[null,null,{"$error":"#N/A"}," "]
[null,null,{"$error":"#N/A"}," "]
[null,null,{"$error":"#N/A"}," "]
[null,null,{"$error":"#N/A"}," "]
[null,null,{"$error":"#N/A"}," "]
[null,null,{"$error":"#N/A"}," "]
[null,null,{"$error":"#N/A"}," "]
[null,null,{"$error":"#N/A"}," "]
[null,null,{"$error":"#N/A"}," "]
[null,null,{"$error":"#N/A"}," "]
[null,null,{"$error":"#N/A"}," "]
[null,null,{"$error":"#N/A"}," "]
[null,null,{"$error":"#N/A"}," "]
[null,null,{"$error":"#N/A"}," "]
[null,null,{"$error":"#N/A"}," "]
[null,null,{"$error":"#N/A"}," "]
[null,null,{"$error":"#N/A"}," "]
[null,null,{"$error":"#N/A"}," "]
[null,null,{"$error":"#N/A"}," "]
[null,null,{"$error":"#N/A"}," "]
[null,null,{"$error":"#N/A"}," "]
[null,null,{"$error":"#N/A"}," "]
[null,null,{"$error":"#N/A"}," "]
[null,null,{"$error":"#N/A"}," "]
[null,null,{"$f":"VLOOKUP(A455,matriz_obj,2,FALSE)","v":{"$error":"#N/A"}},{"$f":"IF(B455>0,IF(A455>0,\" \",\"Seleccione el Objetivo Específico Asociado\"),\" \")","v":" "}]
[null,null,{"$error":"#N/A"}," "]
[null,null,{"$error":"#N/A"}," "]
[null,null,{"$error":"#N/A"}," "]
[null,null,{"$error":"#N/A"}," "]
[null,null,{"$error":"#N/A"}," "]
[null,null,{"$error":"#N/A"}," "]
[null,null,{"$error":"#N/A"}," "]
[null,null,{"$error":"#N/A"}," "]
[null,null,{"$error":"#N/A"}," "]
[null,null,{"$error":"#N/A"}," "]
[null,null,{"$error":"#N/A"}," "]
[null,null,{"$error":"#N/A"}," "]
[null,null,{"$error":"#N/A"}," "]
[null,null,{"$error":"#N/A"}," "]
[null,null,{"$error":"#N/A"}," "]
[null,null,{"$error":"#N/A"}," "]
[null,null,{"$error":"#N/A"}," "]
[null,null,{"$error":"#N/A"}," "]
[null,null,{"$error":"#N/A"}," "]
[null,null,{"$error":"#N/A"}," "]
[null,null,{"$error":"#N/A"}," "]
[null,null,{"$error":"#N/A"}," "]
[null,null,{"$error":"#N/A"}," "]
[null,null,{"$error":"#N/A"}," "]
[null,null,{"$error":"#N/A"}," "]
[null,null,{"$error":"#N/A"}," "]
[null,null,{"$error":"#N/A"}," "]
[null,null,{"$error":"#N/A"}," "]
[null,null,{"$error":"#N/A"}," "]
[null,null,{"$error":"#N/A"}," "]
[null,null,{"$error":"#N/A"}," "]
[null,null,{"$error":"#N/A"}," "]
[null,null,{"$error":"#N/A"}," "]
[null,null,{"$error":"#N/A"}," "]
[null,null,{"$error":"#N/A"}," "]
[null,null,{"$error":"#N/A"}," "]
[null,null,{"$error":"#N/A"}," "]
[null,null,{"$error":"#N/A"}," "]
[null,null,{"$error":"#N/A"}," "]
[null,null,{"$error":"#N/A"}," "]
[null,null,{"$error":"#N/A"}," "]
[null,null,{"$error":"#N/A"}," "]
[null,null,{"$error":"#N/A"}," "]
[null,null,{"$error":"#N/A"}," "]
[null,null,{"$error":"#N/A"}," "]
[null,null,{"$error":"#N/A"}," "]
[null,null,{"$error":"#N/A"}," "]
[null,null,{"$error":"#N/A"}," "]
[null,null,{"$error":"#N/A"}," "]
[null,null,{"$error":"#N/A"}," "]
[null,null,{"$error":"#N/A"}," "]
[null,null,{"$error":"#N/A"}," "]
[null,null,{"$error":"#N/A"}," "]
[null,null,{"$error":"#N/A"}," "]
[null,null,{"$error":"#N/A"}," "]
[null,null,{"$error":"#N/A"}," "]
[null,null,{"$error":"#N/A"}," "]
[null,null,{"$error":"#N/A"}," "]
[null,null,{"$error":"#N/A"}," "]
[null,null,{"$error":"#N/A"}," "]
[null,null,{"$error":"#N/A"}," "]
[null,null,{"$error":"#N/A"}," "]
[null,null,{"$error":"#N/A"}," "]
[null,null,{"$f":"VLOOKUP(A519,matriz_obj,2,FALSE)","v":{"$error":"#N/A"}},{"$f":"IF(B519>0,IF(A519>0,\" \",\"Seleccione el Objetivo Específico Asociado\"),\" \")","v":" "}]
[null,null,{"$error":"#N/A"}," "]
[null,null,{"$error":"#N/A"}," "]
[null,null,{"$error":"#N/A"}," "]
[null,null,{"$error":"#N/A"}," "]
[null,null,{"$error":"#N/A"}," "]
[null,null,{"$error":"#N/A"}," "]
[null,null,{"$error":"#N/A"}," "]
[null,null,{"$error":"#N/A"}," "]
[null,null,{"$error":"#N/A"}," "]
[null,null,{"$error":"#N/A"}," "]
[null,null,{"$error":"#N/A"}," "]
[null,null,{"$error":"#N/A"}," "]
[null,null,{"$error":"#N/A"}," "]
[null,null,{"$error":"#N/A"}," "]
[null,null,{"$error":"#N/A"}," "]
[null,null,{"$error":"#N/A"}," "]
[null,null,{"$error":"#N/A"}," "]
[null,null,{"$error":"#N/A"}," "]
[null,null,{"$error":"#N/A"}," "]
[null,null,{"$error":"#N/A"}," "]
[null,null,{"$error":"#N/A"}," "]
[null,null,{"$error":"#N/A"}," "]
[null,null,{"$error":"#N/A"}," "]
[null,null,{"$error":"#N/A"}," "]
[null,null,{"$error":"#N/A"}," "]
[null,null,{"$error":"#N/A"}," "]
[null,null,{"$error":"#N/A"}," "]
[null,null,{"$error":"#N/A"}," "]
[null,null,{"$error":"#N/A"}," "]
[null,null,{"$error":"#N/A"}," "]
[null,null,{"$error":"#N/A"}," "]
[null,null,{"$error":"#N/A"}," "]
[null,null,{"$error":"#N/A"}," "]
[null,null,{"$error":"#N/A"}," "]
[null,null,{"$error":"#N/A"}," "]
[null,null,{"$error":"#N/A"}," "]
[null,null,{"$error":"#N/A"}," "]
[null,null,{"$error":"#N/A"}," "]
[null,null,{"$error":"#N/A"}," "]
[null,null,{"$error":"#N/A"}," "]
[null,null,{"$error":"#N/A"}," "]
[null,null,{"$error":"#N/A"}," "]
[null,null,{"$error":"#N/A"}," "]
[null,null,{"$error":"#N/A"}," "]
[null,null,{"$error":"#N/A"}," "]
[null,null,{"$error":"#N/A"}," "]
[null,null,{"$error":"#N/A"}," "]
[null,null,{"$error":"#N/A"}," "]
[null,null,{"$error":"#N/A"}," "]
[null,null,{"$error":"#N/A"}," "]
[null,null,{"$error":"#N/A"}," "]
[null,null,{"$error":"#N/A"}," "]
[null,null,{"$error":"#N/A"}," "]
[null,null,{"$error":"#N/A"}," "]
[null,null,{"$error":"#N/A"}," "]
[null,null,{"$error":"#N/A"}," "]
[null,null,{"$error":"#N/A"}," "]
[null,null,{"$error":"#N/A"}," "]
[null,null,{"$error":"#N/A"}," "]
[null,null,{"$error":"#N/A"}," "]
[null,null,{"$error":"#N/A"}," "]
[null,null,{"$error":"#N/A"}," "]
[null,null,{"$error":"#N/A"}," "]
[null,null,{"$f":"VLOOKUP(A583,matriz_obj,2,FALSE)","v":{"$error":"#N/A"}},{"$f":"IF(B583>0,IF(A583>0,\" \",\"Seleccione el Objetivo Específico Asociado\"),\" \")","v":" "}]
[null,null,{"$error":"#N/A"}," "]
[null,null,{"$error":"#N/A"}," "]
[null,null,{"$error":"#N/A"}," "]
[null,null,{"$error":"#N/A"}," "]
[null,null,{"$error":"#N/A"}," "]
[null,null,{"$error":"#N/A"}," "]
[null,null,{"$error":"#N/A"}," "]
[null,null,{"$error":"#N/A"}," "]
[null,null,{"$error":"#N/A"}," "]
[null,null,{"$error":"#N/A"}," "]
[null,null,{"$error":"#N/A"}," "]
[null,null,{"$error":"#N/A"}," "]
[null,null,{"$error":"#N/A"}," "]
[null,null,{"$error":"#N/A"}," "]
[null,null,{"$error":"#N/A"}," "]
[null,null,{"$error":"#N/A"}," "]
[null,null,{"$error":"#N/A"}," "]
[null,null,{"$error":"#N/A"}," "]
[null,null,{"$error":"#N/A"}," "]
[null,null,{"$error":"#N/A"}," "]
[null,null,{"$error":"#N/A"}," "]
[null,null,{"$error":"#N/A"}," "]
[null,null,{"$error":"#N/A"}," "]
[null,null,{"$error":"#N/A"}," "]
[null,null,{"$error":"#N/A"}," "]
[null,null,{"$error":"#N/A"}," "]
[null,null,{"$error":"#N/A"}," "]
[null,null,{"$error":"#N/A"}," "]
[null,null,{"$error":"#N/A"}," "]
[null,null,{"$error":"#N/A"}," "]
[null,null,{"$error":"#N/A"}," "]
[null,null,{"$error":"#N/A"}," "]
[null,null,{"$error":"#N/A"}," "]
[null,null,{"$error":"#N/A"}," "]
[null,null,{"$error":"#N/A"}," "]
[null,null,{"$error":"#N/A"}," "]
[null,null,{"$error":"#N/A"}," "]
[null,null,{"$error":"#N/A"}," "]
[null,null,{"$error":"#N/A"}," "]
[null,null,{"$error":"#N/A"}," "]
[null,null,{"$error":"#N/A"}," "]
[null,null,{"$error":"#N/A"}," "]
[null,null,{"$error":"#N/A"}," "]
[null,null,{"$error":"#N/A"}," "]
[null,null,{"$error":"#N/A"}," "]
[null,null,{"$error":"#N/A"}," "]
[null,null,{"$error":"#N/A"}," "]
[null,null,{"$error":"#N/A"}," "]
[null,null,{"$error":"#N/A"}," "]
[null,null,{"$error":"#N/A"}," "]
[null,null,{"$error":"#N/A"}," "]
[null,null,{"$error":"#N/A"}," "]
[null,null,{"$error":"#N/A"}," "]
[null,null,{"$error":"#N/A"}," "]
[null,null,{"$error":"#N/A"}," "]
[null,null,{"$error":"#N/A"}," "]
[null,null,{"$error":"#N/A"}," "]
[null,null,{"$error":"#N/A"}," "]
[null,null,{"$error":"#N/A"}," "]
[null,null,{"$error":"#N/A"}," "]
[null,null,{"$error":"#N/A"}," "]
[null,null,{"$error":"#N/A"}," "]
[null,null,{"$error":"#N/A"}," "]
[null,null,{"$f":"VLOOKUP(A647,matriz_obj,2,FALSE)","v":{"$error":"#N/A"}},{"$f":"IF(B647>0,IF(A647>0,\" \",\"Seleccione el Objetivo Específico Asociado\"),\" \")","v":" "}]
[null,null,{"$error":"#N/A"}," "]
[null,null,{"$error":"#N/A"}," "]
[null,null,{"$error":"#N/A"}," "]
[null,null,{"$error":"#N/A"}," "]
[null,null,{"$error":"#N/A"}," "]
[null,null,{"$error":"#N/A"}," "]
[null,null,{"$error":"#N/A"}," "]
[null,null,{"$error":"#N/A"}," "]
[null,null,{"$error":"#N/A"}," "]
[null,null,{"$error":"#N/A"}," "]
[null,null,{"$error":"#N/A"}," "]
[null,null,{"$error":"#N/A"}," "]
[null,null,{"$error":"#N/A"}," "]
[null,null,{"$error":"#N/A"}," "]
[null,null,{"$error":"#N/A"}," "]
[null,null,{"$error":"#N/A"}," "]
[null,null,{"$error":"#N/A"}," "]
[null,null,{"$error":"#N/A"}," "]
[null,null,{"$error":"#N/A"}," "]
[null,null,{"$error":"#N/A"}," "]
[null,null,{"$error":"#N/A"}," "]
[null,null,{"$error":"#N/A"}," "]
[null,null,{"$error":"#N/A"}," "]
[null,null,{"$error":"#N/A"}," "]
[null,null,{"$error":"#N/A"}," "]
[null,null,{"$error":"#N/A"}," "]
[null,null,{"$error":"#N/A"}," "]
[null,null,{"$error":"#N/A"}," "]
[null,null,{"$error":"#N/A"}," "]
[null,null,{"$error":"#N/A"}," "]
[null,null,{"$error":"#N/A"}," "]
[null,null,{"$error":"#N/A"}," "]
[null,null,{"$error":"#N/A"}," "]
[null,null,{"$error":"#N/A"}," "]
[null,null,{"$error":"#N/A"}," "]
[null,null,{"$error":"#N/A"}," "]
[null,null,{"$error":"#N/A"}," "]
[null,null,{"$error":"#N/A"}," "]
[null,null,{"$error":"#N/A"}," "]
[null,null,{"$error":"#N/A"}," "]
[null,null,{"$error":"#N/A"}," "]
[null,null,{"$error":"#N/A"}," "]
[null,null,{"$error":"#N/A"}," "]
[null,null,{"$error":"#N/A"}," "]
[null,null,{"$error":"#N/A"}," "]
[null,null,{"$error":"#N/A"}," "]
[null,null,{"$error":"#N/A"}," "]
[null,null,{"$error":"#N/A"}," "]
[null,null,{"$error":"#N/A"}," "]
[null,null,{"$error":"#N/A"}," "]
[null,null,{"$error":"#N/A"}," "]
[null,null,{"$error":"#N/A"}," "]
[null,null,{"$error":"#N/A"}," "]
[null,null,{"$error":"#N/A"}," "]
[null,null,{"$error":"#N/A"}," "]
[null,null,{"$error":"#N/A"}," "]
[null,null,{"$error":"#N/A"}," "]
[null,null,{"$error":"#N/A"}," "]
[null,null,{"$error":"#N/A"}," "]
[null,null,{"$error":"#N/A"}," "]
[null,null,{"$error":"#N/A"}," "]
[null,null,{"$error":"#N/A"}," "]
[null,null,{"$error":"#N/A"}," "]
[null,null,{"$f":"VLOOKUP(A711,matriz_obj,2,FALSE)","v":{"$error":"#N/A"}},{"$f":"IF(B711>0,IF(A711>0,\" \",\"Seleccione el Objetivo Específico Asociado\"),\" \")","v":" "}]
[null,null,{"$error":"#N/A"}," "]
[null,null,{"$error":"#N/A"}," "]
[null,null,{"$error":"#N/A"}," "]
[null,null,{"$error":"#N/A"}," "]
[null,null,{"$error":"#N/A"}," "]
[null,null,{"$error":"#N/A"}," "]
[null,null,{"$error":"#N/A"}," "]
[null,null,{"$error":"#N/A"}," "]
[null,null,{"$error":"#N/A"}," "]
[null,null,{"$error":"#N/A"}," "]
[null,null,{"$error":"#N/A"}," "]
[null,null,{"$error":"#N/A"}," "]
[null,null,{"$error":"#N/A"}," "]
[null,null,{"$error":"#N/A"}," "]
[null,null,{"$error":"#N/A"}," "]
[null,null,{"$error":"#N/A"}," "]
[null,null,{"$error":"#N/A"}," "]
[null,null,{"$error":"#N/A"}," "]
[null,null,{"$error":"#N/A"}," "]
[null,null,{"$error":"#N/A"}," "]
[null,null,{"$error":"#N/A"}," "]
[null,null,{"$error":"#N/A"}," "]
[null,null,{"$error":"#N/A"}," "]
[null,null,{"$error":"#N/A"}," "]
[null,null,{"$error":"#N/A"}," "]
[null,null,{"$error":"#N/A"}," "]
[null,null,{"$error":"#N/A"}," "]
[null,null,{"$error":"#N/A"}," "]
[null,null,{"$error":"#N/A"}," "]
[null,null,{"$error":"#N/A"}," "]
[null,null,{"$error":"#N/A"}," "]
[null,null,{"$error":"#N/A"}," "]
[null,null,{"$error":"#N/A"}," "]
[null,null,{"$error":"#N/A"}," "]
[null,null,{"$error":"#N/A"}," "]
[null,null,{"$error":"#N/A"}," "]
[null,null,{"$error":"#N/A"}," "]
[null,null,{"$error":"#N/A"}," "]
[null,null,{"$error":"#N/A"}," "]
[null,null,{"$error":"#N/A"}," "]
[null,null,{"$error":"#N/A"}," "]
[null,null,{"$error":"#N/A"}," "]
[null,null,{"$error":"#N/A"}," "]
[null,null,{"$error":"#N/A"}," "]
[null,null,{"$error":"#N/A"}," "]
[null,null,{"$error":"#N/A"}," "]
[null,null,{"$error":"#N/A"}," "]
[null,null,{"$error":"#N/A"}," "]
[null,null,{"$error":"#N/A"}," "]
[null,null,{"$error":"#N/A"}," "]
[null,null,{"$error":"#N/A"}," "]
[null,null,{"$error":"#N/A"}," "]
[null,null,{"$error":"#N/A"}," "]
[null,null,{"$error":"#N/A"}," "]
[null,null,{"$error":"#N/A"}," "]
[null,null,{"$error":"#N/A"}," "]
[null,null,{"$error":"#N/A"}," "]
[null,null,{"$error":"#N/A"}," "]
[null,null,{"$error":"#N/A"}," "]
[null,null,{"$error":"#N/A"}," "]
[null,null,{"$error":"#N/A"}," "]
[null,null,{"$error":"#N/A"}," "]
[null,null,{"$error":"#N/A"}," "]
[null,null,{"$f":"VLOOKUP(A775,matriz_obj,2,FALSE)","v":{"$error":"#N/A"}},{"$f":"IF(B775>0,IF(A775>0,\" \",\"Seleccione el Objetivo Específico Asociado\"),\" \")","v":" "}]
[null,null,{"$error":"#N/A"}," "]
[null,null,{"$error":"#N/A"}," "]
[null,null,{"$error":"#N/A"}," "]
[null,null,{"$error":"#N/A"}," "]
[null,null,{"$error":"#N/A"}," "]
[null,null,{"$error":"#N/A"}," "]
[null,null,{"$error":"#N/A"}," "]
[null,null,{"$error":"#N/A"}," "]
[null,null,{"$error":"#N/A"}," "]
[null,null,{"$error":"#N/A"}," "]
[null,null,{"$error":"#N/A"}," "]
[null,null,{"$error":"#N/A"}," "]
[null,null,{"$error":"#N/A"}," "]
[null,null,{"$error":"#N/A"}," "]
[null,null,{"$error":"#N/A"}," "]
[null,null,{"$error":"#N/A"}," "]
[null,null,{"$error":"#N/A"}," "]
[null,null,{"$error":"#N/A"}," "]
[null,null,{"$error":"#N/A"}," "]
[null,null,{"$error":"#N/A"}," "]
[null,null,{"$error":"#N/A"}," "]
[null,null,{"$error":"#N/A"}," "]
[null,null,{"$error":"#N/A"}," "]
[null,null,{"$error":"#N/A"}," "]
[null,null,{"$error":"#N/A"}," "]
[null,null,{"$error":"#N/A"}," "]
[null,null,{"$error":"#N/A"}," "]
[null,null,{"$error":"#N/A"}," "]
[null,null,{"$error":"#N/A"}," "]
[null,null,{"$error":"#N/A"}," "]
[null,null,{"$error":"#N/A"}," "]
[null,null,{"$error":"#N/A"}," "]
[null,null,{"$error":"#N/A"}," "]
[null,null,{"$error":"#N/A"}," "]
[null,null,{"$error":"#N/A"}," "]
[null,null,{"$error":"#N/A"}," "]
[null,null,{"$error":"#N/A"}," "]
[null,null,{"$error":"#N/A"}," "]
[null,null,{"$error":"#N/A"}," "]
[null,null,{"$error":"#N/A"}," "]
[null,null,{"$error":"#N/A"}," "]
[null,null,{"$error":"#N/A"}," "]
[null,null,{"$error":"#N/A"}," "]
[null,null,{"$error":"#N/A"}," "]
[null,null,{"$error":"#N/A"}," "]
[null,null,{"$error":"#N/A"}," "]
[null,null,{"$error":"#N/A"}," "]
[null,null,{"$error":"#N/A"}," "]
[null,null,{"$error":"#N/A"}," "]
[null,null,{"$error":"#N/A"}," "]
[null,null,{"$error":"#N/A"}," "]
[null,null,{"$error":"#N/A"}," "]
[null,null,{"$error":"#N/A"}," "]
[null,null,{"$error":"#N/A"}," "]
[null,null,{"$error":"#N/A"}," "]
[null,null,{"$error":"#N/A"}," "]
[null,null,{"$error":"#N/A"}," "]
[null,null,{"$error":"#N/A"}," "]
[null,null,{"$error":"#N/A"}," "]
[null,null,{"$error":"#N/A"}," "]
[null,null,{"$error":"#N/A"}," "]
[null,null,{"$error":"#N/A"}," "]
[null,null,{"$error":"#N/A"}," "]
[null,null,{"$f":"VLOOKUP(A839,matriz_obj,2,FALSE)","v":{"$error":"#N/A"}},{"$f":"IF(B839>0,IF(A839>0,\" \",\"Seleccione el Objetivo Específico Asociado\"),\" \")","v":" "}]
[null,null,{"$error":"#N/A"}," "]
[null,null,{"$error":"#N/A"}," "]
[null,null,{"$error":"#N/A"}," "]
[null,null,{"$error":"#N/A"}," "]
[null,null,{"$error":"#N/A"}," "]
[null,null,{"$error":"#N/A"}," "]
[null,null,{"$error":"#N/A"}," "]
[null,null,{"$error":"#N/A"}," "]
[null,null,{"$error":"#N/A"}," "]
[null,null,{"$error":"#N/A"}," "]
[null,null,{"$error":"#N/A"}," "]
[null,null,{"$error":"#N/A"}," "]
[null,null,{"$error":"#N/A"}," "]
[null,null,{"$error":"#N/A"}," "]
[null,null,{"$error":"#N/A"}," "]
[null,null,{"$error":"#N/A"}," "]
[null,null,{"$error":"#N/A"}," "]
[null,null,{"$error":"#N/A"}," "]
[null,null,{"$error":"#N/A"}," "]
[null,null,{"$error":"#N/A"}," "]
[null,null,{"$error":"#N/A"}," "]
[null,null,{"$error":"#N/A"}," "]
[null,null,{"$error":"#N/A"}," "]
[null,null,{"$error":"#N/A"}," "]
[null,null,{"$error":"#N/A"}," "]
[null,null,{"$error":"#N/A"}," "]
[null,null,{"$error":"#N/A"}," "]
[null,null,{"$error":"#N/A"}," "]
[null,null,{"$error":"#N/A"}," "]
[null,null,{"$error":"#N/A"}," "]
[null,null,{"$error":"#N/A"}," "]
[null,null,{"$error":"#N/A"}," "]
[null,null,{"$error":"#N/A"}," "]
[null,null,{"$error":"#N/A"}," "]
[null,null,{"$error":"#N/A"}," "]
[null,null,{"$error":"#N/A"}," "]
[null,null,{"$error":"#N/A"}," "]
[null,null,{"$error":"#N/A"}," "]
[null,null,{"$error":"#N/A"}," "]
[null,null,{"$error":"#N/A"}," "]
[null,null,{"$error":"#N/A"}," "]
[null,null,{"$error":"#N/A"}," "]
[null,null,{"$error":"#N/A"}," "]
[null,null,{"$error":"#N/A"}," "]
[null,null,{"$error":"#N/A"}," "]
[null,null,{"$error":"#N/A"}," "]
[null,null,{"$error":"#N/A"}," "]
[null,null,{"$error":"#N/A"}," "]
[null,null,{"$error":"#N/A"}," "]
[null,null,{"$error":"#N/A"}," "]
[null,null,{"$error":"#N/A"}," "]
[null,null,{"$error":"#N/A"}," "]
[null,null,{"$error":"#N/A"}," "]
[null,null,{"$error":"#N/A"}," "]
[null,null,{"$error":"#N/A"}," "]
[null,null,{"$error":"#N/A"}," "]
[null,null,{"$error":"#N/A"}," "]
[null,null,{"$error":"#N/A"}," "]
[null,null,{"$error":"#N/A"}," "]
[null,null,{"$error":"#N/A"}," "]
[null,null,{"$error":"#N/A"}," "]
[null,null,{"$error":"#N/A"}," "]
[null,null,{"$error":"#N/A"}," "]
[null,null,{"$f":"VLOOKUP(A903,matriz_obj,2,FALSE)","v":{"$error":"#N/A"}},{"$f":"IF(B903>0,IF(A903>0,\" \",\"Seleccione el Objetivo Específico Asociado\"),\" \")","v":" "}]
[null,null,{"$error":"#N/A"}," "]
[null,null,{"$error":"#N/A"}," "]
[null,null,{"$error":"#N/A"}," "]
[null,null,{"$error":"#N/A"}," "]
[null,null,{"$error":"#N/A"}," "]
[null,null,{"$error":"#N/A"}," "]
[null,null,{"$error":"#N/A"}," "]
[null,null,{"$error":"#N/A"}," "]
[null,null,{"$error":"#N/A"}," "]
[null,null,{"$error":"#N/A"}," "]
[null,null,{"$error":"#N/A"}," "]
[null,null,{"$error":"#N/A"}," "]
[null,null,{"$error":"#N/A"}," "]
[null,null,{"$error":"#N/A"}," "]
[null,null,{"$error":"#N/A"}," "]
[null,null,{"$error":"#N/A"}," "]
[null,null,{"$error":"#N/A"}," "]
[null,null,{"$error":"#N/A"}," "]
[null,null,{"$error":"#N/A"}," "]
[null,null,{"$error":"#N/A"}," "]
[null,null,{"$error":"#N/A"}," "]
[null,null,{"$error":"#N/A"}," "]
[null,null,{"$error":"#N/A"}," "]
[null,null,{"$error":"#N/A"}," "]
[null,null,{"$error":"#N/A"}," "]
[null,null,{"$error":"#N/A"}," "]
[null,null,{"$error":"#N/A"}," "]
[null,null,{"$error":"#N/A"}," "]
[null,null,{"$error":"#N/A"}," "]
[null,null,{"$error":"#N/A"}," "]
[null,null,{"$error":"#N/A"}," "]
[null,null,{"$error":"#N/A"}," "]
[null,null,{"$error":"#N/A"}," "]
[null,null,{"$error":"#N/A"}," "]
[null,null,{"$error":"#N/A"}," "]
[null,null,{"$error":"#N/A"}," "]
[null,null,{"$error":"#N/A"}," "]
[null,null,{"$error":"#N/A"}," "]
[null,null,{"$error":"#N/A"}," "]
[null,null,{"$error":"#N/A"}," "]
[null,null,{"$error":"#N/A"}," "]
[null,null,{"$error":"#N/A"}," "]
[null,null,{"$error":"#N/A"}," "]
[null,null,{"$error":"#N/A"}," "]
[null,null,{"$error":"#N/A"}," "]
[null,null,{"$error":"#N/A"}," "]
[null,null,{"$error":"#N/A"}," "]
[null,null,{"$error":"#N/A"}," "]
[null,null,{"$error":"#N/A"}," "]
[null,null,{"$error":"#N/A"}," "]
[null,null,{"$error":"#N/A"}," "]
[null,null,{"$error":"#N/A"}," "]
[null,null,{"$error":"#N/A"}," "]
[null,null,{"$error":"#N/A"}," "]
[null,null,{"$error":"#N/A"}," "]
[null,null,{"$error":"#N/A"}," "]
[null,null,{"$error":"#N/A"}," "]
[null,null,{"$error":"#N/A"}," "]
[null,null,{"$error":"#N/A"}," "]
[null,null,{"$error":"#N/A"}," "]
[null,null,{"$error":"#N/A"}," "]
[null,null,{"$error":"#N/A"}," "]
[null,null,{"$error":"#N/A"}," "]
[null,null,{"$f":"VLOOKUP(A967,matriz_obj,2,FALSE)","v":{"$error":"#N/A"}},{"$f":"IF(B967>0,IF(A967>0,\" \",\"Seleccione el Objetivo Específico Asociado\"),\" \")","v":" "}]
[null,null,{"$error":"#N/A"}," "]
[null,null,{"$error":"#N/A"}," "]
[null,null,{"$error":"#N/A"}," "]
[null,null,{"$error":"#N/A"}," "]
[null,null,{"$error":"#N/A"}," "]
[null,null,{"$error":"#N/A"}," "]
[null,null,{"$error":"#N/A"}," "]
[null,null,{"$error":"#N/A"}," "]
[null,null,{"$error":"#N/A"}," "]
[null,null,{"$error":"#N/A"}," "]
[null,null,{"$error":"#N/A"}," "]
[null,null,{"$error":"#N/A"}," "]
[null,null,{"$error":"#N/A"}," "]
[null,null,{"$error":"#N/A"}," "]
[null,null,{"$error":"#N/A"}," "]
[null,null,{"$error":"#N/A"}," "]
[null,null,{"$error":"#N/A"}," "]
[null,null,{"$error":"#N/A"}," "]
[null,null,{"$error":"#N/A"}," "]
[null,null,{"$error":"#N/A"}," "]
[null,null,{"$error":"#N/A"}," "]
[null,null,{"$error":"#N/A"}," "]
[null,null,{"$error":"#N/A"}," "]
[null,null,{"$error":"#N/A"}," "]
[null,null,{"$error":"#N/A"}," "]
[null,null,{"$error":"#N/A"}," "]
[null,null,{"$error":"#N/A"}," "]
[null,null,{"$error":"#N/A"}," "]
[null,null,{"$error":"#N/A"}," "]
[null,null,{"$error":"#N/A"}," "]
[null,null,{"$error":"#N/A"}," "]
[null,null,{"$error":"#N/A"}," "]
[null,null,{"$error":"#N/A"}," "]
[null,null,{"$error":"#N/A"}," "]
[null,null,{"$error":"#N/A"}," "]
[null,null,{"$error":"#N/A"}," "]
[null,null,{"$error":"#N/A"}," "]
[null,null,{"$error":"#N/A"}," "]
[null,null,{"$error":"#N/A"}," "]
[null,null,{"$error":"#N/A"}," "]
[null,null,{"$error":"#N/A"}," "]
[null,null,{"$error":"#N/A"}," "]
[null,null,{"$error":"#N/A"}," "]
[null,null,{"$error":"#N/A"}," "]
[null,null,{"$error":"#N/A"}," "]
[null,null,{"$error":"#N/A"}," "]
[null,null,{"$error":"#N/A"}," "]
[null,null,{"$error":"#N/A"}," "]
[null,null,{"$error":"#N/A"}," "]
[null,null,{"$error":"#N/A"}," "]
[null,null,{"$error":"#N/A"}," "]
[null,null,{"$error":"#N/A"}," "]
[null,null,{"$error":"#N/A"}," "]
[null,null,{"$error":"#N/A"}," "]
[null,null,{"$error":"#N/A"}," "]
[null,null,{"$error":"#N/A"}," "]
[null,null,{"$error":"#N/A"}," "]
[null,null,{"$error":"#N/A"}," "]
[null,null,{"$error":"#N/A"}," "]
[null,null,{"$error":"#N/A"}," "]
[null,null,{"$error":"#N/A"}," "]
[null,null,{"$error":"#N/A"}," "]
[null,null,{"$error":"#N/A"}," "]
[null,null,{"$f":"VLOOKUP(A1031,matriz_obj,2,FALSE)","v":{"$error":"#N/A"}},{"$f":"IF(B1031>0,IF(A1031>0,\" \",\"Seleccione el Objetivo Específico Asociado\"),\" \")","v":" "}]
[null,null,{"$error":"#N/A"}," "]
[null,null,{"$error":"#N/A"}," "]
[null,null,{"$error":"#N/A"}," "]
[null,null,{"$error":"#N/A"}," "]
[null,null,{"$error":"#N/A"}," "]
[null,null,{"$error":"#N/A"}," "]
[null,null,{"$error":"#N/A"}," "]
[null,null,{"$error":"#N/A"}," "]
[null,null,{"$error":"#N/A"}," "]
[null,null,{"$error":"#N/A"}," "]
[null,null,{"$error":"#N/A"}," "]
[null,null,{"$error":"#N/A"}," "]
[null,null,{"$error":"#N/A"}," "]
[null,null,{"$error":"#N/A"}," "]
[null,null,{"$error":"#N/A"}," "]
[null,null,{"$error":"#N/A"}," "]
[null,null,{"$error":"#N/A"}," "]
[null,null,{"$error":"#N/A"}," "]
[null,null,{"$error":"#N/A"}," "]
[null,null,{"$error":"#N/A"}," "]
[null,null,{"$error":"#N/A"}," "]
[null,null,{"$error":"#N/A"}," "]
[null,null,{"$error":"#N/A"}," "]
[null,null,{"$error":"#N/A"}," "]
[null,null,{"$error":"#N/A"}," "]
[null,null,{"$error":"#N/A"}," "]
[null,null,{"$error":"#N/A"}," "]
[null,null,{"$error":"#N/A"}," "]
[null,null,{"$error":"#N/A"}," "]
[null,null,{"$error":"#N/A"}," "]
[null,null,{"$error":"#N/A"}," "]
[null,null,{"$error":"#N/A"}," "]
[null,null,{"$error":"#N/A"}," "]
[null,null,{"$error":"#N/A"}," "]
[null,null,{"$error":"#N/A"}," "]
[null,null,{"$error":"#N/A"}," "]
[null,null,{"$error":"#N/A"}," "]
[null,null,{"$error":"#N/A"}," "]
[null,null,{"$error":"#N/A"}," "]
[null,null,{"$error":"#N/A"}," "]
[null,null,{"$error":"#N/A"}," "]
[null,null,{"$error":"#N/A"}," "]
[null,null,{"$error":"#N/A"}," "]
[null,null,{"$error":"#N/A"}," "]
[null,null,{"$error":"#N/A"}," "]
[null,null,{"$error":"#N/A"}," "]
[null,null,{"$error":"#N/A"}," "]
[null,null,{"$error":"#N/A"}," "]
[null,null,{"$error":"#N/A"}," "]
[null,null,{"$error":"#N/A"}," "]
[null,null,{"$error":"#N/A"}," "]
[null,null,{"$error":"#N/A"}," "]
[null,null,{"$error":"#N/A"}," "]
[null,null,{"$error":"#N/A"}," "]
[null,null,{"$error":"#N/A"}," "]
[null,null,{"$error":"#N/A"}," "]
[null,null,{"$error":"#N/A"}," "]
[null,null,{"$error":"#N/A"}," "]
[null,null,{"$error":"#N/A"}," "]
[null,null,{"$error":"#N/A"}," "]
[null,null,{"$error":"#N/A"}," "]
[null,null,{"$error":"#N/A"}," "]
[null,null,{"$error":"#N/A"}," "]
[null,null,{"$f":"VLOOKUP(A1095,matriz_obj,2,FALSE)","v":{"$error":"#N/A"}},{"$f":"IF(B1095>0,IF(A1095>0,\" \",\"Seleccione el Objetivo Específico Asociado\"),\" \")","v":" "}]
[null,null,{"$error":"#N/A"}," "]
[null,null,{"$error":"#N/A"}," "]
[null,null,{"$error":"#N/A"}," "]
[null,null,{"$error":"#N/A"}," "]
[null,null,{"$error":"#N/A"}," "]
[null,null,{"$error":"#N/A"}," "]
[null,null,{"$error":"#N/A"}," "]
[null,null,{"$error":"#N/A"}," "]
[null,null,{"$error":"#N/A"}," "]
[null,null,{"$error":"#N/A"}," "]
[null,null,{"$error":"#N/A"}," "]
[null,null,{"$error":"#N/A"}," "]
[null,null,{"$error":"#N/A"}," "]
[null,null,{"$error":"#N/A"}," "]
[null,null,{"$error":"#N/A"}," "]
[null,null,{"$error":"#N/A"}," "]
[null,null,{"$error":"#N/A"}," "]
[null,null,{"$error":"#N/A"}," "]
[null,null,{"$error":"#N/A"}," "]
[null,null,{"$error":"#N/A"}," "]
[null,null,{"$error":"#N/A"}," "]
[null,null,{"$error":"#N/A"}," "]
[null,null,{"$error":"#N/A"}," "]
[null,null,{"$error":"#N/A"}," "]
[null,null,{"$error":"#N/A"}," "]
[null,null,{"$error":"#N/A"}," "]
[null,null,{"$error":"#N/A"}," "]
[null,null,{"$error":"#N/A"}," "]
[null,null,{"$error":"#N/A"}," "]
[null,null,{"$error":"#N/A"}," "]
[null,null,{"$error":"#N/A"}," "]
[null,null,{"$error":"#N/A"}," "]
[null,null,{"$error":"#N/A"}," "]
[null,null,{"$error":"#N/A"}," "]
[null,null,{"$error":"#N/A"}," "]
[null,null,{"$error":"#N/A"}," "]
[null,null,{"$error":"#N/A"}," "]
[null,null,{"$error":"#N/A"}," "]
[null,null,{"$error":"#N/A"}," "]
[null,null,{"$error":"#N/A"}," "]
[null,null,{"$error":"#N/A"}," "]
[null,null,{"$error":"#N/A"}," "]
[null,null,{"$error":"#N/A"}," "]
[null,null,{"$error":"#N/A"}," "]
[null,null,{"$error":"#N/A"}," "]
[null,null,{"$error":"#N/A"}," "]
[null,null,{"$error":"#N/A"}," "]
[null,null,{"$error":"#N/A"}," "]
[null,null,{"$error":"#N/A"}," "]
[null,null,{"$error":"#N/A"}," "]
[null,null,{"$error":"#N/A"}," "]
[null,null,{"$error":"#N/A"}," "]
[null,null,{"$error":"#N/A"}," "]
[null,null,{"$error":"#N/A"}," "]
[null,null,{"$error":"#N/A"}," "]
[null,null,{"$error":"#N/A"}," "]
[null,null,{"$error":"#N/A"}," "]
[null,null,{"$error":"#N/A"}," "]
[null,null,{"$error":"#N/A"}," "]
[null,null,{"$error":"#N/A"}," "]
[null,null,{"$error":"#N/A"}," "]
[null,null,{"$error":"#N/A"}," "]
[null,null,{"$error":"#N/A"}," "]
[null,null,{"$f":"VLOOKUP(A1159,matriz_obj,2,FALSE)","v":{"$error":"#N/A"}},{"$f":"IF(B1159>0,IF(A1159>0,\" \",\"Seleccione el Objetivo Específico Asociado\"),\" \")","v":" "}]
[null,null,{"$error":"#N/A"}," "]
[null,null,{"$error":"#N/A"}," "]
[null,null,{"$error":"#N/A"}," "]
[null,null,{"$error":"#N/A"}," "]
[null,null,{"$error":"#N/A"}," "]
[null,null,{"$error":"#N/A"}," "]
[null,null,{"$error":"#N/A"}," "]
[null,null,{"$error":"#N/A"}," "]
[null,null,{"$error":"#N/A"}," "]
[null,null,{"$error":"#N/A"}," "]
[null,null,{"$error":"#N/A"}," "]
[null,null,{"$error":"#N/A"}," "]
[null,null,{"$error":"#N/A"}," "]
[null,null,{"$error":"#N/A"}," "]
[null,null,{"$error":"#N/A"}," "]
[null,null,{"$error":"#N/A"}," "]
[null,null,{"$error":"#N/A"}," "]
[null,null,{"$error":"#N/A"}," "]
[null,null,{"$error":"#N/A"}," "]
[null,null,{"$error":"#N/A"}," "]
[null,null,{"$error":"#N/A"}," "]
[null,null,{"$error":"#N/A"}," "]
[null,null,{"$error":"#N/A"}," "]
[null,null,{"$error":"#N/A"}," "]
[null,null,{"$error":"#N/A"}," "]
[null,null,{"$error":"#N/A"}," "]
[null,null,{"$error":"#N/A"}," "]
[null,null,{"$error":"#N/A"}," "]
[null,null,{"$error":"#N/A"}," "]
[null,null,{"$error":"#N/A"}," "]
[null,null,{"$error":"#N/A"}," "]
[null,null,{"$error":"#N/A"}," "]
[null,null,{"$error":"#N/A"}," "]
[null,null,{"$error":"#N/A"}," "]
[null,null,{"$error":"#N/A"}," "]
[null,null,{"$error":"#N/A"}," "]
[null,null,{"$error":"#N/A"}," "]
[null,null,{"$error":"#N/A"}," "]
[null,null,{"$error":"#N/A"}," "]
[null,null,{"$error":"#N/A"}," "]
[null,null,{"$error":"#N/A"}," "]
[null,null,{"$error":"#N/A"}," "]
[null,null,{"$error":"#N/A"}," "]
[null,null,{"$error":"#N/A"}," "]
[null,null,{"$error":"#N/A"}," "]
[null,null,{"$error":"#N/A"}," "]
[null,null,{"$error":"#N/A"}," "]
[null,null,{"$error":"#N/A"}," "]
[null,null,{"$error":"#N/A"}," "]
[null,null,{"$error":"#N/A"}," "]
[null,null,{"$error":"#N/A"}," "]
[null,null,{"$error":"#N/A"}," "]
[null,null,{"$error":"#N/A"}," "]
[null,null,{"$error":"#N/A"}," "]
[null,null,{"$error":"#N/A"}," "]
[null,null,{"$error":"#N/A"}," "]
[null,null,{"$error":"#N/A"}," "]
[null,null,{"$error":"#N/A"}," "]
[null,null,{"$error":"#N/A"}," "]
[null,null,{"$error":"#N/A"}," "]
[null,null,{"$error":"#N/A"}," "]
[null,null,{"$error":"#N/A"}," "]
[null,null,{"$error":"#N/A"}," "]
[null,null,{"$f":"VLOOKUP(A1223,matriz_obj,2,FALSE)","v":{"$error":"#N/A"}},{"$f":"IF(B1223>0,IF(A1223>0,\" \",\"Seleccione el Objetivo Específico Asociado\"),\" \")","v":" "}]
[null,null,{"$error":"#N/A"}," "]
[null,null,{"$error":"#N/A"}," "]
[null,null,{"$error":"#N/A"}," "]
[null,null,{"$error":"#N/A"}," "]
[null,null,{"$error":"#N/A"}," "]
[null,null,{"$error":"#N/A"}," "]
[null,null,{"$error":"#N/A"}," "]
[null,null,{"$error":"#N/A"}," "]
[null,null,{"$error":"#N/A"}," "]
[null,null,{"$error":"#N/A"}," "]
[null,null,{"$error":"#N/A"}," "]
[null,null,{"$error":"#N/A"}," "]
[null,null,{"$error":"#N/A"}," "]
[null,null,{"$error":"#N/A"}," "]
[null,null,{"$error":"#N/A"}," "]
[null,null,{"$error":"#N/A"}," "]
[null,null,{"$error":"#N/A"}," "]
[null,null,{"$error":"#N/A"}," "]
[null,null,{"$error":"#N/A"}," "]
[null,null,{"$error":"#N/A"}," "]
[null,null,{"$error":"#N/A"}," "]
[null,null,{"$error":"#N/A"}," "]
[null,null,{"$error":"#N/A"}," "]
[null,null,{"$error":"#N/A"}," "]
[null,null,{"$error":"#N/A"}," "]
[null,null,{"$error":"#N/A"}," "]
[null,null,{"$error":"#N/A"}," "]
[null,null,{"$error":"#N/A"}," "]
[null,null,{"$error":"#N/A"}," "]
[null,null,{"$error":"#N/A"}," "]
[null,null,{"$error":"#N/A"}," "]
[null,null,{"$error":"#N/A"}," "]
[null,null,{"$error":"#N/A"}," "]
[null,null,{"$error":"#N/A"}," "]
[null,null,{"$error":"#N/A"}," "]
[null,null,{"$error":"#N/A"}," "]
[null,null,{"$error":"#N/A"}," "]
[null,null,{"$error":"#N/A"}," "]
[null,null,{"$error":"#N/A"}," "]
[null,null,{"$error":"#N/A"}," "]
[null,null,{"$error":"#N/A"}," "]
[null,null,{"$error":"#N/A"}," "]
[null,null,{"$error":"#N/A"}," "]
[null,null,{"$error":"#N/A"}," "]
[null,null,{"$error":"#N/A"}," "]
[null,null,{"$error":"#N/A"}," "]
[null,null,{"$error":"#N/A"}," "]
[null,null,{"$error":"#N/A"}," "]
[null,null,{"$error":"#N/A"}," "]
[null,null,{"$error":"#N/A"}," "]
[null,null,{"$error":"#N/A"}," "]
[null,null,{"$error":"#N/A"}," "]
[null,null,{"$error":"#N/A"}," "]
[null,null,{"$error":"#N/A"}," "]
[null,null,{"$error":"#N/A"}," "]
[null,null,{"$error":"#N/A"}," "]
[null,null,{"$error":"#N/A"}," "]
[null,null,{"$error":"#N/A"}," "]
[null,null,{"$error":"#N/A"}," "]
[null,null,{"$error":"#N/A"}," "]
[null,null,{"$error":"#N/A"}," "]
[null,null,{"$error":"#N/A"}," "]
[null,null,{"$error":"#N/A"}," "]
[null,null,{"$f":"VLOOKUP(A1287,matriz_obj,2,FALSE)","v":{"$error":"#N/A"}},{"$f":"IF(B1287>0,IF(A1287>0,\" \",\"Seleccione el Objetivo Específico Asociado\"),\" \")","v":" "}]
[null,null,{"$error":"#N/A"}," "]
[null,null,{"$error":"#N/A"}," "]
[null,null,{"$error":"#N/A"}," "]
[null,null,{"$error":"#N/A"}," "]
[null,null,{"$error":"#N/A"}," "]
[null,null,{"$error":"#N/A"}," "]
[null,null,{"$error":"#N/A"}," "]
[null,null,{"$error":"#N/A"}," "]
[null,null,{"$error":"#N/A"}," "]
[null,null,{"$error":"#N/A"}," "]
[null,null,{"$error":"#N/A"}," "]
[null,null,{"$error":"#N/A"}," "]
[null,null,{"$error":"#N/A"}," "]
[null,null,{"$error":"#N/A"}," "]
[null,null,{"$error":"#N/A"}," "]
[null,null,{"$error":"#N/A"}," "]
[null,null,{"$error":"#N/A"}," "]
[null,null,{"$error":"#N/A"}," "]
[null,null,{"$error":"#N/A"}," "]
[null,null,{"$error":"#N/A"}," "]
[null,null,{"$error":"#N/A"}," "]
[null,null,{"$error":"#N/A"}," "]
[null,null,{"$error":"#N/A"}," "]
[null,null,{"$error":"#N/A"}," "]
[null,null,{"$error":"#N/A"}," "]
[null,null,{"$error":"#N/A"}," "]
[null,null,{"$error":"#N/A"}," "]
[null,null,{"$error":"#N/A"}," "]
[null,null,{"$error":"#N/A"}," "]
[null,null,{"$error":"#N/A"}," "]
[null,null,{"$error":"#N/A"}," "]
[null,null,{"$error":"#N/A"}," "]
[null,null,{"$error":"#N/A"}," "]
[null,null,{"$error":"#N/A"}," "]
[null,null,{"$error":"#N/A"}," "]
[null,null,{"$error":"#N/A"}," "]
[null,null,{"$error":"#N/A"}," "]
[null,null,{"$error":"#N/A"}," "]
[null,null,{"$error":"#N/A"}," "]
[null,null,{"$error":"#N/A"}," "]
[null,null,{"$error":"#N/A"}," "]
[null,null,{"$error":"#N/A"}," "]
[null,null,{"$error":"#N/A"}," "]
[null,null,{"$error":"#N/A"}," "]
[null,null,{"$error":"#N/A"}," "]
[null,null,{"$error":"#N/A"}," "]
[null,null,{"$error":"#N/A"}," "]
[null,null,{"$error":"#N/A"}," "]
[null,null,{"$error":"#N/A"}," "]
[null,null,{"$error":"#N/A"}," "]
[null,null,{"$error":"#N/A"}," "]
[null,null,{"$error":"#N/A"}," "]
[null,null,{"$error":"#N/A"}," "]
[null,null,{"$error":"#N/A"}," "]
[null,null,{"$error":"#N/A"}," "]
[null,null,{"$error":"#N/A"}," "]
[null,null,{"$error":"#N/A"}," "]
[null,null,{"$error":"#N/A"}," "]
[null,null,{"$error":"#N/A"}," "]
[null,null,{"$error":"#N/A"}," "]
[null,null,{"$error":"#N/A"}," "]
[null,null,{"$error":"#N/A"}," "]
[null,null,{"$error":"#N/A"}," "]
[null,null,{"$f":"VLOOKUP(A1351,matriz_obj,2,FALSE)","v":{"$error":"#N/A"}},{"$f":"IF(B1351>0,IF(A1351>0,\" \",\"Seleccione el Objetivo Específico Asociado\"),\" \")","v":" "}]
[null,null,{"$error":"#N/A"}," "]
[null,null,{"$error":"#N/A"}," "]
[null,null,{"$error":"#N/A"}," "]
[null,null,{"$error":"#N/A"}," "]
[null,null,{"$error":"#N/A"}," "]
[null,null,{"$error":"#N/A"}," "]
[null,null,{"$error":"#N/A"}," "]
[null,null,{"$error":"#N/A"}," "]
[null,null,{"$error":"#N/A"}," "]
[null,null,{"$error":"#N/A"}," "]
[null,null,{"$error":"#N/A"}," "]
[null,null,{"$error":"#N/A"}," "]
[null,null,{"$error":"#N/A"}," "]
[null,null,{"$error":"#N/A"}," "]
[null,null,{"$error":"#N/A"}," "]
[null,null,{"$error":"#N/A"}," "]
[null,null,{"$error":"#N/A"}," "]
[null,null,{"$error":"#N/A"}," "]
[null,null,{"$error":"#N/A"}," "]
[null,null,{"$error":"#N/A"}," "]
[null,null,{"$error":"#N/A"}," "]
[null,null,{"$error":"#N/A"}," "]
[null,null,{"$error":"#N/A"}," "]
[null,null,{"$error":"#N/A"}," "]
[null,null,{"$error":"#N/A"}," "]
[null,null,{"$error":"#N/A"}," "]
[null,null,{"$error":"#N/A"}," "]
[null,null,{"$error":"#N/A"}," "]
[null,null,{"$error":"#N/A"}," "]
[null,null,{"$error":"#N/A"}," "]
[null,null,{"$error":"#N/A"}," "]
[null,null,{"$error":"#N/A"}," "]
[null,null,{"$error":"#N/A"}," "]
[null,null,{"$error":"#N/A"}," "]
[null,null,{"$error":"#N/A"}," "]
[null,null,{"$error":"#N/A"}," "]
[null,null,{"$error":"#N/A"}," "]
[null,null,{"$error":"#N/A"}," "]
[null,null,{"$error":"#N/A"}," "]
[null,null,{"$error":"#N/A"}," "]
[null,null,{"$error":"#N/A"}," "]
[null,null,{"$error":"#N/A"}," "]
[null,null,{"$error":"#N/A"}," "]
[null,null,{"$error":"#N/A"}," "]
[null,null,{"$error":"#N/A"}," "]
[null,null,{"$error":"#N/A"}," "]
[null,null,{"$error":"#N/A"}," "]
[null,null,{"$error":"#N/A"}," "]
[null,null,{"$error":"#N/A"}," "]
[null,null,{"$error":"#N/A"}," "]
[null,null,{"$error":"#N/A"}," "]
[null,null,{"$error":"#N/A"}," "]
[null,null,{"$error":"#N/A"}," "]
[null,null,{"$error":"#N/A"}," "]
[null,null,{"$error":"#N/A"}," "]
[null,null,{"$error":"#N/A"}," "]
[null,null,{"$error":"#N/A"}," "]
[null,null,{"$error":"#N/A"}," "]
[null,null,{"$error":"#N/A"}," "]
[null,null,{"$error":"#N/A"}," "]
[null,null,{"$error":"#N/A"}," "]
[null,null,{"$error":"#N/A"}," "]
[null,null,{"$error":"#N/A"}," "]
[null,null,{"$f":"VLOOKUP(A1415,matriz_obj,2,FALSE)","v":{"$error":"#N/A"}},{"$f":"IF(B1415>0,IF(A1415>0,\" \",\"Seleccione el Objetivo Específico Asociado\"),\" \")","v":" "}]
[null,null,{"$error":"#N/A"}," "]
[null,null,{"$error":"#N/A"}," "]
[null,null,{"$error":"#N/A"}," "]
[null,null,{"$error":"#N/A"}," "]
[null,null,{"$error":"#N/A"}," "]
[null,null,{"$error":"#N/A"}," "]
[null,null,{"$error":"#N/A"}," "]
[null,null,{"$error":"#N/A"}," "]
[null,null,{"$error":"#N/A"}," "]
[null,null,{"$error":"#N/A"}," "]
[null,null,{"$error":"#N/A"}," "]
[null,null,{"$error":"#N/A"}," "]
[null,null,{"$error":"#N/A"}," "]
[null,null,{"$error":"#N/A"}," "]
[null,null,{"$error":"#N/A"}," "]
[null,null,{"$error":"#N/A"}," "]
[null,null,{"$error":"#N/A"}," "]
[null,null,{"$error":"#N/A"}," "]
[null,null,{"$error":"#N/A"}," "]
[null,null,{"$error":"#N/A"}," "]
[null,null,{"$error":"#N/A"}," "]
[null,null,{"$error":"#N/A"}," "]
[null,null,{"$error":"#N/A"}," "]
[null,null,{"$error":"#N/A"}," "]
[null,null,{"$error":"#N/A"}," "]
[null,null,{"$error":"#N/A"}," "]
[null,null,{"$error":"#N/A"}," "]
[null,null,{"$error":"#N/A"}," "]
[null,null,{"$error":"#N/A"}," "]
[null,null,{"$error":"#N/A"}," "]
[null,null,{"$error":"#N/A"}," "]
[null,null,{"$error":"#N/A"}," "]
[null,null,{"$error":"#N/A"}," "]
[null,null,{"$error":"#N/A"}," "]
[null,null,{"$error":"#N/A"}," "]
[null,null,{"$error":"#N/A"}," "]
[null,null,{"$error":"#N/A"}," "]
[null,null,{"$error":"#N/A"}," "]
[null,null,{"$error":"#N/A"}," "]
[null,null,{"$error":"#N/A"}," "]
[null,null,{"$error":"#N/A"}," "]
[null,null,{"$error":"#N/A"}," "]
[null,null,{"$error":"#N/A"}," "]
[null,null,{"$error":"#N/A"}," "]
[null,null,{"$error":"#N/A"}," "]
[null,null,{"$error":"#N/A"}," "]
[null,null,{"$error":"#N/A"}," "]
[null,null,{"$error":"#N/A"}," "]
[null,null,{"$error":"#N/A"}," "]
[null,null,{"$error":"#N/A"}," "]
[null,null,{"$error":"#N/A"}," "]
[null,null,{"$error":"#N/A"}," "]
[null,null,{"$error":"#N/A"}," "]
[null,null,{"$error":"#N/A"}," "]
[null,null,{"$error":"#N/A"}," "]
[null,null,{"$error":"#N/A"}," "]
[null,null,{"$error":"#N/A"}," "]
[null,null,{"$error":"#N/A"}," "]
[null,null,{"$error":"#N/A"}," "]
[null,null,{"$error":"#N/A"}," "]
[null,null,{"$error":"#N/A"}," "]
[null,null,{"$error":"#N/A"}," "]
[null,null,{"$error":"#N/A"}," "]
[null,null,{"$f":"VLOOKUP(A1479,matriz_obj,2,FALSE)","v":{"$error":"#N/A"}},{"$f":"IF(B1479>0,IF(A1479>0,\" \",\"Seleccione el Objetivo Específico Asociado\"),\" \")","v":" "}]
[null,null,{"$error":"#N/A"}," "]
[null,null,{"$error":"#N/A"}," "]
[null,null,{"$error":"#N/A"}," "]
[null,null,{"$error":"#N/A"}," "]
[null,null,{"$error":"#N/A"}," "]
[null,null,{"$error":"#N/A"}," "]
[null,null,{"$error":"#N/A"}," "]
[null,null,{"$error":"#N/A"}," "]
[null,null,{"$error":"#N/A"}," "]
[null,null,{"$error":"#N/A"}," "]
[null,null,{"$error":"#N/A"}," "]
[null,null,{"$error":"#N/A"}," "]
[null,null,{"$error":"#N/A"}," "]
[null,null,{"$error":"#N/A"}," "]
[null,null,{"$error":"#N/A"}," "]
[null,null,{"$error":"#N/A"}," "]
[null,null,{"$error":"#N/A"}," "]
[null,null,{"$error":"#N/A"}," "]
[null,null,{"$error":"#N/A"}," "]
[null,null,{"$error":"#N/A"}," "]
[null,null,{"$error":"#N/A"}," "]
[null,null,{"$error":"#N/A"}," "]
[null,null,{"$error":"#N/A"}," "]
[null,null,{"$error":"#N/A"}," "]
[null,null,{"$error":"#N/A"}," "]
[null,null,{"$error":"#N/A"}," "]
[null,null,{"$error":"#N/A"}," "]
[null,null,{"$error":"#N/A"}," "]
[null,null,{"$error":"#N/A"}," "]
[null,null,{"$error":"#N/A"}," "]
[null,null,{"$error":"#N/A"}," "]
[null,null,{"$error":"#N/A"}," "]
[null,null,{"$error":"#N/A"}," "]
[null,null,{"$error":"#N/A"}," "]
[null,null,{"$error":"#N/A"}," "]
[null,null,{"$error":"#N/A"}," "]
[null,null,{"$error":"#N/A"}," "]
[null,null,{"$error":"#N/A"}," "]
[null,null,{"$error":"#N/A"}," "]
[null,null,{"$error":"#N/A"}," "]
[null,null,{"$error":"#N/A"}," "]
[null,null,{"$error":"#N/A"}," "]
[null,null,{"$error":"#N/A"}," "]
[null,null,{"$error":"#N/A"}," "]
[null,null,{"$error":"#N/A"}," "]
[null,null,{"$error":"#N/A"}," "]
[null,null,{"$error":"#N/A"}," "]
[null,null,{"$error":"#N/A"}," "]
[null,null,{"$error":"#N/A"}," "]
[null,null,{"$error":"#N/A"}," "]
[null,null,{"$error":"#N/A"}," "]
[null,null,{"$error":"#N/A"}," "]
[null,null,{"$error":"#N/A"}," "]
[null,null,{"$error":"#N/A"}," "]
[null,null,{"$error":"#N/A"}," "]
[null,null,{"$error":"#N/A"}," "]
[null,null,{"$error":"#N/A"}," "]
[null,null,{"$error":"#N/A"}," "]
[null,null,{"$error":"#N/A"}," "]
[null,null,{"$error":"#N/A"}," "]
[null,null,{"$error":"#N/A"}," "]
[null,null,{"$error":"#N/A"}," "]
[null,null,{"$error":"#N/A"}," "]
[null,null,{"$f":"VLOOKUP(A1543,matriz_obj,2,FALSE)","v":{"$error":"#N/A"}},{"$f":"IF(B1543>0,IF(A1543>0,\" \",\"Seleccione el Objetivo Específico Asociado\"),\" \")","v":" "}]
[null,null,{"$error":"#N/A"}," "]
[null,null,{"$error":"#N/A"}," "]
[null,null,{"$error":"#N/A"}," "]
[null,null,{"$error":"#N/A"}," "]
[null,null,{"$error":"#N/A"}," "]
[null,null,{"$error":"#N/A"}," "]
[null,null,{"$error":"#N/A"}," "]
[null,null,{"$error":"#N/A"}," "]
[null,null,{"$error":"#N/A"}," "]
[null,null,{"$error":"#N/A"}," "]
[null,null,{"$error":"#N/A"}," "]
[null,null,{"$error":"#N/A"}," "]
[null,null,{"$error":"#N/A"}," "]
[null,null,{"$error":"#N/A"}," "]
[null,null,{"$error":"#N/A"}," "]
[null,null,{"$error":"#N/A"}," "]
[null,null,{"$error":"#N/A"}," "]
[null,null,{"$error":"#N/A"}," "]
[null,null,{"$error":"#N/A"}," "]
[null,null,{"$error":"#N/A"}," "]
[null,null,{"$error":"#N/A"}," "]
[null,null,{"$error":"#N/A"}," "]
[null,null,{"$error":"#N/A"}," "]
[null,null,{"$error":"#N/A"}," "]
[null,null,{"$error":"#N/A"}," "]
[null,null,{"$error":"#N/A"}," "]
[null,null,{"$error":"#N/A"}," "]
[null,null,{"$error":"#N/A"}," "]
[null,null,{"$error":"#N/A"}," "]
[null,null,{"$error":"#N/A"}," "]
[null,null,{"$error":"#N/A"}," "]
[null,null,{"$error":"#N/A"}," "]
[null,null,{"$error":"#N/A"}," "]
[null,null,{"$error":"#N/A"}," "]
[null,null,{"$error":"#N/A"}," "]
[null,null,{"$error":"#N/A"}," "]
[null,null,{"$error":"#N/A"}," "]
[null,null,{"$error":"#N/A"}," "]
[null,null,{"$error":"#N/A"}," "]
[null,null,{"$error":"#N/A"}," "]
[null,null,{"$error":"#N/A"}," "]
[null,null,{"$error":"#N/A"}," "]
[null,null,{"$error":"#N/A"}," "]
[null,null,{"$error":"#N/A"}," "]
[null,null,{"$error":"#N/A"}," "]
[null,null,{"$error":"#N/A"}," "]
[null,null,{"$error":"#N/A"}," "]
[null,null,{"$error":"#N/A"}," "]
[null,null,{"$error":"#N/A"}," "]
[null,null,{"$error":"#N/A"}," "]
[null,null,{"$error":"#N/A"}," "]
[null,null,{"$error":"#N/A"}," "]
[null,null,{"$error":"#N/A"}," "]
[null,null,{"$error":"#N/A"}," "]
[null,null,{"$error":"#N/A"}," "]
[null,null,{"$error":"#N/A"}," "]
[null,null,{"$error":"#N/A"}," "]
[null,null,{"$error":"#N/A"}," "]
[null,null,{"$error":"#N/A"}," "]
[null,null,{"$error":"#N/A"}," "]
[null,null,{"$error":"#N/A"}," "]
[null,null,{"$error":"#N/A"}," "]
[null,null,{"$error":"#N/A"}," "]
[null,null,{"$f":"VLOOKUP(A1607,matriz_obj,2,FALSE)","v":{"$error":"#N/A"}},{"$f":"IF(B1607>0,IF(A1607>0,\" \",\"Seleccione el Objetivo Específico Asociado\"),\" \")","v":" "}]
[null,null,{"$error":"#N/A"}," "]
[null,null,{"$error":"#N/A"}," "]
[null,null,{"$error":"#N/A"}," "]
[null,null,{"$error":"#N/A"}," "]
[null,null,{"$error":"#N/A"}," "]
[null,null,{"$error":"#N/A"}," "]
[null,null,{"$error":"#N/A"}," "]
[null,null,{"$error":"#N/A"}," "]
[null,null,{"$error":"#N/A"}," "]
[null,null,{"$error":"#N/A"}," "]
[null,null,{"$error":"#N/A"}," "]
[null,null,{"$error":"#N/A"}," "]
[null,null,{"$error":"#N/A"}," "]
[null,null,{"$error":"#N/A"}," "]
[null,null,{"$error":"#N/A"}," "]
[null,null,{"$error":"#N/A"}," "]
[null,null,{"$error":"#N/A"}," "]
[null,null,{"$error":"#N/A"}," "]
[null,null,{"$error":"#N/A"}," "]
[null,null,{"$error":"#N/A"}," "]
[null,null,{"$error":"#N/A"}," "]
[null,null,{"$error":"#N/A"}," "]
[null,null,{"$error":"#N/A"}," "]
[null,null,{"$error":"#N/A"}," "]
[null,null,{"$error":"#N/A"}," "]
[null,null,{"$error":"#N/A"}," "]
[null,null,{"$error":"#N/A"}," "]
[null,null,{"$error":"#N/A"}," "]
[null,null,{"$error":"#N/A"}," "]
[null,null,{"$error":"#N/A"}," "]
[null,null,{"$error":"#N/A"}," "]
[null,null,{"$error":"#N/A"}," "]
[null,null,{"$error":"#N/A"}," "]
[null,null,{"$error":"#N/A"}," "]
[null,null,{"$error":"#N/A"}," "]
[null,null,{"$error":"#N/A"}," "]
[null,null,{"$error":"#N/A"}," "]
[null,null,{"$error":"#N/A"}," "]
[null,null,{"$error":"#N/A"}," "]
[null,null,{"$error":"#N/A"}," "]
[null,null,{"$error":"#N/A"}," "]
[null,null,{"$error":"#N/A"}," "]
[null,null,{"$error":"#N/A"}," "]
[null,null,{"$error":"#N/A"}," "]
[null,null,{"$error":"#N/A"}," "]
[null,null,{"$error":"#N/A"}," "]
[null,null,{"$error":"#N/A"}," "]
[null,null,{"$error":"#N/A"}," "]
[null,null,{"$error":"#N/A"}," "]
[null,null,{"$error":"#N/A"}," "]
[null,null,{"$error":"#N/A"}," "]
[null,null,{"$error":"#N/A"}," "]
[null,null,{"$error":"#N/A"}," "]
[null,null,{"$error":"#N/A"}," "]
[null,null,{"$error":"#N/A"}," "]
[null,null,{"$error":"#N/A"}," "]
[null,null,{"$error":"#N/A"}," "]
[null,null,{"$error":"#N/A"}," "]
[null,null,{"$error":"#N/A"}," "]
[null,null,{"$error":"#N/A"}," "]
[null,null,{"$error":"#N/A"}," "]
[null,null,{"$error":"#N/A"}," "]
[null,null,{"$error":"#N/A"}," "]
[null,null,{"$f":"VLOOKUP(A1671,matriz_obj,2,FALSE)","v":{"$error":"#N/A"}},{"$f":"IF(B1671>0,IF(A1671>0,\" \",\"Seleccione el Objetivo Específico Asociado\"),\" \")","v":" "}]
[null,null,{"$error":"#N/A"}," "]
[null,null,{"$error":"#N/A"}," "]
[null,null,{"$error":"#N/A"}," "]
[null,null,{"$error":"#N/A"}," "]
[null,null,{"$error":"#N/A"}," "]
[null,null,{"$error":"#N/A"}," "]
[null,null,{"$error":"#N/A"}," "]
[null,null,{"$error":"#N/A"}," "]
[null,null,{"$error":"#N/A"}," "]
[null,null,{"$error":"#N/A"}," "]
[null,null,{"$error":"#N/A"}," "]
[null,null,{"$error":"#N/A"}," "]
[null,null,{"$error":"#N/A"}," "]
[null,null,{"$error":"#N/A"}," "]
[null,null,{"$error":"#N/A"}," "]
[null,null,{"$error":"#N/A"}," "]
[null,null,{"$error":"#N/A"}," "]
[null,null,{"$error":"#N/A"}," "]
[null,null,{"$error":"#N/A"}," "]
[null,null,{"$error":"#N/A"}," "]
[null,null,{"$error":"#N/A"}," "]
[null,null,{"$error":"#N/A"}," "]
[null,null,{"$error":"#N/A"}," "]
[null,null,{"$error":"#N/A"}," "]
[null,null,{"$error":"#N/A"}," "]
[null,null,{"$error":"#N/A"}," "]
[null,null,{"$error":"#N/A"}," "]
[null,null,{"$error":"#N/A"}," "]
[null,null,{"$error":"#N/A"}," "]
[null,null,{"$error":"#N/A"}," "]
[null,null,{"$error":"#N/A"}," "]
[null,null,{"$error":"#N/A"}," "]
[null,null,{"$error":"#N/A"}," "]
[null,null,{"$error":"#N/A"}," "]
[null,null,{"$error":"#N/A"}," "]
[null,null,{"$error":"#N/A"}," "]
[null,null,{"$error":"#N/A"}," "]
[null,null,{"$error":"#N/A"}," "]
[null,null,{"$error":"#N/A"}," "]
[null,null,{"$error":"#N/A"}," "]
[null,null,{"$error":"#N/A"}," "]
[null,null,{"$error":"#N/A"}," "]
[null,null,{"$error":"#N/A"}," "]
[null,null,{"$error":"#N/A"}," "]
[null,null,{"$error":"#N/A"}," "]
[null,null,{"$error":"#N/A"}," "]
[null,null,{"$error":"#N/A"}," "]
[null,null,{"$error":"#N/A"}," "]
[null,null,{"$error":"#N/A"}," "]
[null,null,{"$error":"#N/A"}," "]
[null,null,{"$error":"#N/A"}," "]
[null,null,{"$error":"#N/A"}," "]
[null,null,{"$error":"#N/A"}," "]
[null,null,{"$error":"#N/A"}," "]
[null,null,{"$error":"#N/A"}," "]
[null,null,{"$error":"#N/A"}," "]
[null,null,{"$error":"#N/A"}," "]
[null,null,{"$error":"#N/A"}," "]
[null,null,{"$error":"#N/A"}," "]
[null,null,{"$error":"#N/A"}," "]
[null,null,{"$error":"#N/A"}," "]
[null,null,{"$error":"#N/A"}," "]
[null,null,{"$error":"#N/A"}," "]
[null,null,{"$f":"VLOOKUP(A1735,matriz_obj,2,FALSE)","v":{"$error":"#N/A"}},{"$f":"IF(B1735>0,IF(A1735>0,\" \",\"Seleccione el Objetivo Específico Asociado\"),\" \")","v":" "}]
[null,null,{"$error":"#N/A"}," "]
[null,null,{"$error":"#N/A"}," "]
[null,null,{"$error":"#N/A"}," "]
[null,null,{"$error":"#N/A"}," "]
[null,null,{"$error":"#N/A"}," "]
[null,null,{"$error":"#N/A"}," "]
[null,null,{"$error":"#N/A"}," "]
[null,null,{"$error":"#N/A"}," "]
[null,null,{"$error":"#N/A"}," "]
[null,null,{"$error":"#N/A"}," "]
[null,null,{"$error":"#N/A"}," "]
[null,null,{"$error":"#N/A"}," "]
[null,null,{"$error":"#N/A"}," "]
[null,null,{"$error":"#N/A"}," "]
[null,null,{"$error":"#N/A"}," "]
[null,null,{"$error":"#N/A"}," "]
[null,null,{"$error":"#N/A"}," "]
[null,null,{"$error":"#N/A"}," "]
[null,null,{"$error":"#N/A"}," "]
[null,null,{"$error":"#N/A"}," "]
[null,null,{"$error":"#N/A"}," "]
[null,null,{"$error":"#N/A"}," "]
[null,null,{"$error":"#N/A"}," "]
[null,null,{"$error":"#N/A"}," "]
[null,null,{"$error":"#N/A"}," "]
[null,null,{"$error":"#N/A"}," "]
[null,null,{"$error":"#N/A"}," "]
[null,null,{"$error":"#N/A"}," "]
[null,null,{"$error":"#N/A"}," "]
[null,null,{"$error":"#N/A"}," "]
[null,null,{"$error":"#N/A"}," "]
[null,null,{"$error":"#N/A"}," "]
[null,null,{"$error":"#N/A"}," "]
[null,null,{"$error":"#N/A"}," "]
[null,null,{"$error":"#N/A"}," "]
[null,null,{"$error":"#N/A"}," "]
[null,null,{"$error":"#N/A"}," "]
[null,null,{"$error":"#N/A"}," "]
[null,null,{"$error":"#N/A"}," "]
[null,null,{"$error":"#N/A"}," "]
[null,null,{"$error":"#N/A"}," "]
[null,null,{"$error":"#N/A"}," "]
[null,null,{"$error":"#N/A"}," "]
[null,null,{"$error":"#N/A"}," "]
[null,null,{"$error":"#N/A"}," "]
[null,null,{"$error":"#N/A"}," "]
[null,null,{"$error":"#N/A"}," "]
[null,null,{"$error":"#N/A"}," "]
[null,null,{"$error":"#N/A"}," "]
[null,null,{"$error":"#N/A"}," "]
[null,null,{"$error":"#N/A"}," "]
[null,null,{"$error":"#N/A"}," "]
[null,null,{"$error":"#N/A"}," "]
[null,null,{"$error":"#N/A"}," "]
[null,null,{"$error":"#N/A"}," "]
[null,null,{"$error":"#N/A"}," "]
[null,null,{"$error":"#N/A"}," "]
[null,null,{"$error":"#N/A"}," "]
[null,null,{"$error":"#N/A"}," "]
[null,null,{"$error":"#N/A"}," "]
[null,null,{"$error":"#N/A"}," "]
[null,null,{"$error":"#N/A"}," "]
[null,null,{"$error":"#N/A"}," "]
[null,null,{"$f":"VLOOKUP(A1799,matriz_obj,2,FALSE)","v":{"$error":"#N/A"}},{"$f":"IF(B1799>0,IF(A1799>0,\" \",\"Seleccione el Objetivo Específico Asociado\"),\" \")","v":" "}]
[null,null,{"$error":"#N/A"}," "]
[null,null,{"$error":"#N/A"}," "]
[null,null,{"$error":"#N/A"}," "]
[null,null,{"$error":"#N/A"}," "]
[null,null,{"$error":"#N/A"}," "]
[null,null,{"$error":"#N/A"}," "]
[null,null,{"$error":"#N/A"}," "]
[null,null,{"$error":"#N/A"}," "]
[null,null,{"$error":"#N/A"}," "]
[null,null,{"$error":"#N/A"}," "]
[null,null,{"$error":"#N/A"}," "]
[null,null,{"$error":"#N/A"}," "]
[null,null,{"$error":"#N/A"}," "]
[null,null,{"$error":"#N/A"}," "]
[null,null,{"$error":"#N/A"}," "]
[null,null,{"$error":"#N/A"}," "]
[null,null,{"$error":"#N/A"}," "]
[null,null,{"$error":"#N/A"}," "]
[null,null,{"$error":"#N/A"}," "]
[null,null,{"$error":"#N/A"}," "]
[null,null,{"$error":"#N/A"}," "]
[null,null,{"$error":"#N/A"}," "]
[null,null,{"$error":"#N/A"}," "]
[null,null,{"$error":"#N/A"}," "]
[null,null,{"$error":"#N/A"}," "]
[null,null,{"$error":"#N/A"}," "]
[null,null,{"$error":"#N/A"}," "]
[null,null,{"$error":"#N/A"}," "]
[null,null,{"$error":"#N/A"}," "]
[null,null,{"$error":"#N/A"}," "]
[null,null,{"$error":"#N/A"}," "]
[null,null,{"$error":"#N/A"}," "]
[null,null,{"$error":"#N/A"}," "]
[null,null,{"$error":"#N/A"}," "]
[null,null,{"$error":"#N/A"}," "]
[null,null,{"$error":"#N/A"}," "]
[null,null,{"$error":"#N/A"}," "]
[null,null,{"$error":"#N/A"}," "]
[null,null,{"$error":"#N/A"}," "]
[null,null,{"$error":"#N/A"}," "]
[null,null,{"$error":"#N/A"}," "]
[null,null,{"$error":"#N/A"}," "]
[null,null,{"$error":"#N/A"}," "]
[null,null,{"$error":"#N/A"}," "]
[null,null,{"$error":"#N/A"}," "]
[null,null,{"$error":"#N/A"}," "]
[null,null,{"$error":"#N/A"}," "]
[null,null,{"$error":"#N/A"}," "]
[null,null,{"$error":"#N/A"}," "]
[null,null,{"$error":"#N/A"}," "]
[null,null,{"$error":"#N/A"}," "]
[null,null,{"$error":"#N/A"}," "]
[null,null,{"$error":"#N/A"}," "]
[null,null,{"$error":"#N/A"}," "]
[null,null,{"$error":"#N/A"}," "]
[null,null,{"$error":"#N/A"}," "]
[null,null,{"$error":"#N/A"}," "]
[null,null,{"$error":"#N/A"}," "]
[null,null,{"$error":"#N/A"}," "]
[null,null,{"$error":"#N/A"}," "]
[null,null,{"$error":"#N/A"}," "]
[null,null,{"$error":"#N/A"}," "]
[null,null,{"$error":"#N/A"}," "]
[null,null,{"$f":"VLOOKUP(A1863,matriz_obj,2,FALSE)","v":{"$error":"#N/A"}},{"$f":"IF(B1863>0,IF(A1863>0,\" \",\"Seleccione el Objetivo Específico Asociado\"),\" \")","v":" "}]
[null,null,{"$error":"#N/A"}," "]
[null,null,{"$error":"#N/A"}," "]
[null,null,{"$error":"#N/A"}," "]
[null,null,{"$error":"#N/A"}," "]
[null,null,{"$error":"#N/A"}," "]
[null,null,{"$error":"#N/A"}," "]
[null,null,{"$error":"#N/A"}," "]
[null,null,{"$error":"#N/A"}," "]
[null,null,{"$error":"#N/A"}," "]
[null,null,{"$error":"#N/A"}," "]
[null,null,{"$error":"#N/A"}," "]
[null,null,{"$error":"#N/A"}," "]
[null,null,{"$error":"#N/A"}," "]
[null,null,{"$error":"#N/A"}," "]
[null,null,{"$error":"#N/A"}," "]
[null,null,{"$error":"#N/A"}," "]
[null,null,{"$error":"#N/A"}," "]
[null,null,{"$error":"#N/A"}," "]
[null,null,{"$error":"#N/A"}," "]
[null,null,{"$error":"#N/A"}," "]
[null,null,{"$error":"#N/A"}," "]
[null,null,{"$error":"#N/A"}," "]
[null,null,{"$error":"#N/A"}," "]
[null,null,{"$error":"#N/A"}," "]
[null,null,{"$error":"#N/A"}," "]
[null,null,{"$error":"#N/A"}," "]
[null,null,{"$error":"#N/A"}," "]
[null,null,{"$error":"#N/A"}," "]
[null,null,{"$error":"#N/A"}," "]
[null,null,{"$error":"#N/A"}," "]
[null,null,{"$error":"#N/A"}," "]
[null,null,{"$error":"#N/A"}," "]
[null,null,{"$error":"#N/A"}," "]
[null,null,{"$error":"#N/A"}," "]
[null,null,{"$error":"#N/A"}," "]
[null,null,{"$error":"#N/A"}," "]
[null,null,{"$error":"#N/A"}," "]
[null,null,{"$error":"#N/A"}," "]
[null,null,{"$error":"#N/A"}," "]
[null,null,{"$error":"#N/A"}," "]
[null,null,{"$error":"#N/A"}," "]
[null,null,{"$error":"#N/A"}," "]
[null,null,{"$error":"#N/A"}," "]
[null,null,{"$error":"#N/A"}," "]
[null,null,{"$error":"#N/A"}," "]
[null,null,{"$error":"#N/A"}," "]
[null,null,{"$error":"#N/A"}," "]
[null,null,{"$error":"#N/A"}," "]
[null,null,{"$error":"#N/A"}," "]
[null,null,{"$error":"#N/A"}," "]
[null,null,{"$error":"#N/A"}," "]
[null,null,{"$error":"#N/A"}," "]
[null,null,{"$error":"#N/A"}," "]
[null,null,{"$error":"#N/A"}," "]
[null,null,{"$error":"#N/A"}," "]
[null,null,{"$error":"#N/A"}," "]
[null,null,{"$error":"#N/A"}," "]
[null,null,{"$error":"#N/A"}," "]
[null,null,{"$error":"#N/A"}," "]
[null,null,{"$error":"#N/A"}," "]
[null,null,{"$error":"#N/A"}," "]
[null,null,{"$error":"#N/A"}," "]
[null,null,{"$error":"#N/A"}," "]
[null,null,{"$f":"VLOOKUP(A1927,matriz_obj,2,FALSE)","v":{"$error":"#N/A"}},{"$f":"IF(B1927>0,IF(A1927>0,\" \",\"Seleccione el Objetivo Específico Asociado\"),\" \")","v":" "}]
[null,null,{"$error":"#N/A"}," "]
[null,null,{"$error":"#N/A"}," "]
[null,null,{"$error":"#N/A"}," "]
[null,null,{"$error":"#N/A"}," "]
[null,null,{"$error":"#N/A"}," "]
[null,null,{"$error":"#N/A"}," "]
[null,null,{"$error":"#N/A"}," "]
[null,null,{"$error":"#N/A"}," "]
[null,null,{"$error":"#N/A"}," "]
[null,null,{"$error":"#N/A"}," "]
[null,null,{"$error":"#N/A"}," "]
[null,null,{"$error":"#N/A"}," "]
[null,null,{"$error":"#N/A"}," "]
[null,null,{"$error":"#N/A"}," "]
[null,null,{"$error":"#N/A"}," "]
[null,null,{"$error":"#N/A"}," "]
[null,null,{"$error":"#N/A"}," "]
[null,null,{"$error":"#N/A"}," "]
[null,null,{"$error":"#N/A"}," "]
[null,null,{"$error":"#N/A"}," "]
[null,null,{"$error":"#N/A"}," "]
[null,null,{"$error":"#N/A"}," "]
[null,null,{"$error":"#N/A"}," "]
[null,null,{"$error":"#N/A"}," "]
[null,null,{"$error":"#N/A"}," "]
[null,null,{"$error":"#N/A"}," "]
[null,null,{"$error":"#N/A"}," "]
[null,null,{"$error":"#N/A"}," "]
[null,null,{"$error":"#N/A"}," "]
[null,null,{"$error":"#N/A"}," "]
[null,null,{"$error":"#N/A"}," "]
[null,null,{"$error":"#N/A"}," "]
[null,null,{"$error":"#N/A"}," "]
[null,null,{"$error":"#N/A"}," "]
[null,null,{"$error":"#N/A"}," "]
[null,null,{"$error":"#N/A"}," "]
[null,null,{"$error":"#N/A"}," "]
[null,null,{"$error":"#N/A"}," "]
[null,null,{"$error":"#N/A"}," "]
[null,null,{"$error":"#N/A"}," "]
[null,null,{"$error":"#N/A"}," "]
[null,null,{"$error":"#N/A"}," "]
[null,null,{"$error":"#N/A"}," "]
[null,null,{"$error":"#N/A"}," "]
[null,null,{"$error":"#N/A"}," "]
[null,null,{"$error":"#N/A"}," "]
[null,null,{"$error":"#N/A"}," "]
[null,null,{"$error":"#N/A"}," "]
[null,null,{"$error":"#N/A"}," "]
[null,null,{"$error":"#N/A"}," "]
[null,null,{"$error":"#N/A"}," "]
[null,null,{"$error":"#N/A"}," "]
[null,null,{"$error":"#N/A"}," "]
[null,null,{"$error":"#N/A"}," "]
[null,null,{"$error":"#N/A"}," "]
[null,null,{"$error":"#N/A"}," "]
[null,null,{"$error":"#N/A"}," "]
[null,null,{"$error":"#N/A"}," "]
[null,null,{"$error":"#N/A"}," "]
[null,null,{"$error":"#N/A"}," "]
[null,null,{"$error":"#N/A"}," "]
[null,null,{"$error":"#N/A"}," "]
[null,null,{"$error":"#N/A"}," "]
[null,null,{"$f":"VLOOKUP(A1991,matriz_obj,2,FALSE)","v":{"$error":"#N/A"}},{"$f":"IF(B1991>0,IF(A1991>0,\" \",\"Seleccione el Objetivo Específico Asociado\"),\" \")","v":" "}]
[null,null,{"$error":"#N/A"}," "]
[null,null,{"$error":"#N/A"}," "]
[null,null,{"$error":"#N/A"}," "]
[null,null,{"$error":"#N/A"}," "]
[null,null,{"$error":"#N/A"}," "]
[null,null,{"$error":"#N/A"}," "]
[null,null,{"$error":"#N/A"}," "]
[null,null,{"$error":"#N/A"}," "]
[null,null,{"$error":"#N/A"}," "]
[null,null,{"$error":"#N/A"}," "]
[null,null,{"$error":"#N/A"}," "]
[null,null,{"$error":"#N/A"}," "]
[null,null,{"$error":"#N/A"}," "]
[null,null,{"$error":"#N/A"}," "]
[null,null,{"$error":"#N/A"}," "]
[null,null,{"$error":"#N/A"}," "]
[null,null,{"$error":"#N/A"}," "]
[null,null,{"$error":"#N/A"}," "]
[null,null,{"$error":"#N/A"}," "]
[null,null,{"$error":"#N/A"}," "]
[null,null,{"$error":"#N/A"}," "]
[null,null,{"$error":"#N/A"}," "]
[null,null,{"$error":"#N/A"}," "]
[null,null,{"$error":"#N/A"}," "]
[null,null,{"$error":"#N/A"}," "]
[null,null,{"$error":"#N/A"}," "]
[null,null,{"$error":"#N/A"}," "]
[null,null,{"$error":"#N/A"}," "]
[null,null,{"$error":"#N/A"}," "]
[null,null,{"$error":"#N/A"}," "]
[null,null,{"$error":"#N/A"}," "]
[null,null,{"$error":"#N/A"}," "]
[null,null,{"$error":"#N/A"}," "]
[null,null,{"$error":"#N/A"}," "]
[null,null,{"$error":"#N/A"}," "]
[null,null,{"$error":"#N/A"}," "]
[null,null,{"$error":"#N/A"}," "]
[null,null,{"$error":"#N/A"}," "]
[null,null,{"$error":"#N/A"}," "]
[null,null,{"$error":"#N/A"}," "]
[null,null,{"$error":"#N/A"}," "]
[null,null,{"$error":"#N/A"}," "]
[null,null,{"$error":"#N/A"}," "]
[null,null,{"$error":"#N/A"}," "]
[null,null,{"$error":"#N/A"}," "]
[null,null,{"$error":"#N/A"}," "]
[null,null,{"$error":"#N/A"}," "]
[null,null,{"$error":"#N/A"}," "]
[null,null,{"$error":"#N/A"}," "]
[null,null,{"$error":"#N/A"}," "]
[null,null,{"$error":"#N/A"}," "]
[null,null,{"$error":"#N/A"}," "]
[null,null,{"$error":"#N/A"}," "]
[null,null,{"$error":"#N/A"}," "]
[null,null,{"$error":"#N/A"}," "]
[null,null,{"$error":"#N/A"}," "]
[null,null,{"$error":"#N/A"}," "]
[null,null,{"$error":"#N/A"}," "]
[null,null,{"$error":"#N/A"}," "]
[null,null,{"$error":"#N/A"}," "]
[null,null,{"$error":"#N/A"}," "]
[null,null,{"$error":"#N/A"}," "]
[null,null,{"$error":"#N/A"}," "]
[null,null,{"$f":"VLOOKUP(A2055,matriz_obj,2,FALSE)","v":{"$error":"#N/A"}},{"$f":"IF(B2055>0,IF(A2055>0,\" \",\"Seleccione el Objetivo Específico Asociado\"),\" \")","v":" "}]
[null,null,{"$error":"#N/A"}," "]
[null,null,{"$error":"#N/A"}," "]
[null,null,{"$error":"#N/A"}," "]
[null,null,{"$error":"#N/A"}," "]
[null,null,{"$error":"#N/A"}," "]
[null,null,{"$error":"#N/A"}," "]
[null,null,{"$error":"#N/A"}," "]
[null,null,{"$error":"#N/A"}," "]
[null,null,{"$error":"#N/A"}," "]
[null,null,{"$error":"#N/A"}," "]
[null,null,{"$error":"#N/A"}," "]
[null,null,{"$error":"#N/A"}," "]
[null,null,{"$error":"#N/A"}," "]
[null,null,{"$error":"#N/A"}," "]
[null,null,{"$error":"#N/A"}," "]
[null,null,{"$error":"#N/A"}," "]
[null,null,{"$error":"#N/A"}," "]
[null,null,{"$error":"#N/A"}," "]
[null,null,{"$error":"#N/A"}," "]
[null,null,{"$error":"#N/A"}," "]
[null,null,{"$error":"#N/A"}," "]
[null,null,{"$error":"#N/A"}," "]
[null,null,{"$error":"#N/A"}," "]
[null,null,{"$error":"#N/A"}," "]
[null,null,{"$error":"#N/A"}," "]
[null,null,{"$error":"#N/A"}," "]
[null,null,{"$error":"#N/A"}," "]
[null,null,{"$error":"#N/A"}," "]
[null,null,{"$error":"#N/A"}," "]
[null,null,{"$error":"#N/A"}," "]
[null,null,{"$error":"#N/A"}," "]
[null,null,{"$error":"#N/A"}," "]
[null,null,{"$error":"#N/A"}," "]
[null,null,{"$error":"#N/A"}," "]
[null,null,{"$error":"#N/A"}," "]
[null,null,{"$error":"#N/A"}," "]
[null,null,{"$error":"#N/A"}," "]
[null,null,{"$error":"#N/A"}," "]
[null,null,{"$error":"#N/A"}," "]
[null,null,{"$error":"#N/A"}," "]
[null,null,{"$error":"#N/A"}," "]
[null,null,{"$error":"#N/A"}," "]
[null,null,{"$error":"#N/A"}," "]
[null,null,{"$error":"#N/A"}," "]
[null,null,{"$error":"#N/A"}," "]
[null,null,{"$error":"#N/A"}," "]
[null,null,{"$error":"#N/A"}," "]
[null,null,{"$error":"#N/A"}," "]
[null,null,{"$error":"#N/A"}," "]
[null,null,{"$error":"#N/A"}," "]
[null,null,{"$error":"#N/A"}," "]
[null,null,{"$error":"#N/A"}," "]
[null,null,{"$error":"#N/A"}," "]
[null,null,{"$error":"#N/A"}," "]
[null,null,{"$error":"#N/A"}," "]
[null,null,{"$error":"#N/A"}," "]
[null,null,{"$error":"#N/A"}," "]
[null,null,{"$error":"#N/A"}," "]
[null,null,{"$error":"#N/A"}," "]
[null,null,{"$error":"#N/A"}," "]
[null,null,{"$error":"#N/A"}," "]
[null,null,{"$error":"#N/A"}," "]
[null,null,{"$error":"#N/A"}," "]
[null,null,{"$f":"VLOOKUP(A2119,matriz_obj,2,FALSE)","v":{"$error":"#N/A"}},{"$f":"IF(B2119>0,IF(A2119>0,\" \",\"Seleccione el Objetivo Específico Asociado\"),\" \")","v":" "}]
[null,null,{"$error":"#N/A"}," "]
[null,null,{"$error":"#N/A"}," "]
[null,null,{"$error":"#N/A"}," "]
[null,null,{"$error":"#N/A"}," "]
[null,null,{"$error":"#N/A"}," "]
[null,null,{"$error":"#N/A"}," "]
[null,null,{"$error":"#N/A"}," "]
[null,null,{"$error":"#N/A"}," "]
[null,null,{"$error":"#N/A"}," "]
[null,null,{"$error":"#N/A"}," "]
[null,null,{"$error":"#N/A"}," "]
[null,null,{"$error":"#N/A"}," "]
[null,null,{"$error":"#N/A"}," "]
[null,null,{"$error":"#N/A"}," "]
[null,null,{"$error":"#N/A"}," "]
[null,null,{"$error":"#N/A"}," "]
[null,null,{"$error":"#N/A"}," "]
[null,null,{"$error":"#N/A"}," "]
[null,null,{"$error":"#N/A"}," "]
[null,null,{"$error":"#N/A"}," "]
[null,null,{"$error":"#N/A"}," "]
[null,null,{"$error":"#N/A"}," "]
[null,null,{"$error":"#N/A"}," "]
[null,null,{"$error":"#N/A"}," "]
[null,null,{"$error":"#N/A"}," "]
[null,null,{"$error":"#N/A"}," "]
[null,null,{"$error":"#N/A"}," "]
[null,null,{"$error":"#N/A"}," "]
[null,null,{"$error":"#N/A"}," "]
[null,null,{"$error":"#N/A"}," "]
[null,null,{"$error":"#N/A"}," "]
[null,null,{"$error":"#N/A"}," "]
[null,null,{"$error":"#N/A"}," "]
[null,null,{"$error":"#N/A"}," "]
[null,null,{"$error":"#N/A"}," "]
[null,null,{"$error":"#N/A"}," "]
[null,null,{"$error":"#N/A"}," "]
[null,null,{"$error":"#N/A"}," "]
[null,null,{"$error":"#N/A"}," "]
[null,null,{"$error":"#N/A"}," "]
[null,null,{"$error":"#N/A"}," "]
[null,null,{"$error":"#N/A"}," "]
[null,null,{"$error":"#N/A"}," "]
[null,null,{"$error":"#N/A"}," "]
[null,null,{"$error":"#N/A"}," "]
[null,null,{"$error":"#N/A"}," "]
[null,null,{"$error":"#N/A"}," "]
[null,null,{"$error":"#N/A"}," "]
[null,null,{"$error":"#N/A"}," "]
[null,null,{"$error":"#N/A"}," "]
[null,null,{"$error":"#N/A"}," "]
[null,null,{"$error":"#N/A"}," "]
[null,null,{"$error":"#N/A"}," "]
[null,null,{"$error":"#N/A"}," "]
[null,null,{"$error":"#N/A"}," "]
[null,null,{"$error":"#N/A"}," "]
[null,null,{"$error":"#N/A"}," "]
[null,null,{"$error":"#N/A"}," "]

{"sheet":"Año 1 E1","index":4,"n_rows":4893,"n_cols":8,"rows_kept":4893,"cut":false,"hidden":true,"merged":[[1,1,1,2]]}
[null,"Año 1 - Etapa 1",null,null,"Proyecto:",{"$f":"+Inicio!$B$9","v":"Escriba el nombre del proyecto postulado…"}]
[null,"Puesta en Marcha y Posicionamiento",null,null,"Beneficiario:",{"$f":"VLOOKUP(\"Beneficiario Mandatario\",Participantes!$B$2:$F$86,5,FALSE)","v":{"$error":"#N/A"}}]
[]
[null,"Para el primer año del proyecto se deberá confeccionar un presupuesto detallado de acuedo a la siguiente tabla:"]
[]
[null,null,null,null,null,"MM$","MM$","MM$"]
[null,null,null,null,null,{"$f":"SUBTOTAL(9,F9:F4893)","v":0},0,{"$f":"SUBTOTAL(9,H9:H4893)","v":0}]
[null,"Cuenta","Ítem","Fuente/Nombre Entidad","Tipo Entidad","Pecuniario","Valorizado","Subtotal"]
[null,null,null,"Corfo",{"$f":"IF(D9>0,VLOOKUP(D9,entidades,2,FALSE),\" \")","v":"Corfo"},null,null,{"$f":"+F9+G9","v":0}]
[null,null,null,null," ",null,null,0]
[null,null,null,null," ",null,null,0]
[null,null,null,null," ",null,null,0]
[null,null,null,null," ",null,null,0]
[null,null,null,null," ",null,null,0]
[null,null,null,null," ",null,null,0]
[null,null,null,null," ",null,null,0]
[null,null,null,null," ",null,null,0]
[null,null,null,null," ",null,null,0]
[null,null,null,null," ",null,null,0]
[null,null,null,null," ",null,null,0]
[null,null,null,null," ",null,null,0]
[null,null,null,null," ",null,null,0]
[null,null,null,null," ",null,null,0]
[null,null,null,null," ",null,null,0]
[null,null,null,null," ",null,null,0]
[null,null,null,null," ",null,null,0]
[null,null,null,null," ",null,null,0]
[null,null,null,null," ",null,null,0]
[null,null,null,null," ",null,null,0]
[null,null,null,null," ",null,null,0]
[null,null,null,null," ",null,null,0]
[null,null,null,null," ",null,null,0]
[null,null,null,null," ",null,null,0]
[null,null,null,null," ",null,null,0]
[null,null,null,null," ",null,null,0]
[null,null,null,null," ",null,null,0]
[null,null,null,null," ",null,null,0]
[null,null,null,null," ",null,null,0]
[null,null,null,null," ",null,null,0]
[null,null,null,null," ",null,null,0]
[null,null,null,null," ",null,null,0]
[null,null,null,null," ",null,null,0]
[null,null,null,null," ",null,null,0]
[null,null,null,null," ",null,null,0]
[null,null,null,null," ",null,null,0]
[null,null,null,null," ",null,null,0]
[null,null,null,null," ",null,null,0]
[null,null,null,null," ",null,null,0]
[null,null,null,null," ",null,null,0]
[null,null,null,null," ",null,null,0]
[null,null,null,null," ",null,null,0]
[null,null,null,null," ",null,null,0]
[null,null,null,null," ",null,null,0]
[null,null,null,null," ",null,null,0]
[null,null,null,null," ",null,null,0]
[null,null,null,null," ",null,null,0]
[null,null,null,null," ",null,null,0]
[null,null,null,null," ",null,null,0]
[null,null,null,null," ",null,null,0]
[null,null,null,null," ",null,null,0]
[null,null,null,null," ",null,null,0]
[null,null,null,null," ",null,null,0]
[null,null,null,null," ",null,null,0]
[null,null,null,null," ",null,null,0]
[null,null,null,null," ",null,null,0]
[null,null,null,null," ",null,null,0]
[null,null,null,null," ",null,null,0]
[null,null,null,null," ",null,null,0]
[null,null,null,null," ",null,null,0]
[null,null,null,null," ",null,null,0]
[null,null,null,null," ",null,null,0]
[null,null,null,null," ",null,null,0]
[null,null,null,null,{"$f":"IF(D73>0,VLOOKUP(D73,entidades,2,FALSE),\" \")","v":" "},null,null,{"$f":"+F73+G73","v":0}]
[null,null,null,null," ",null,null,0]
[null,null,null,null," ",null,null,0]
[null,null,null,null," ",null,null,0]
[null,null,null,null," ",null,null,0]
[null,null,null,null," ",null,null,0]
[null,null,null,null," ",null,null,0]
[null,null,null,null," ",null,null,0]
[null,null,null,null," ",null,null,0]
[null,null,null,null," ",null,null,0]
[null,null,null,null," ",null,null,0]
[null,null,null,null," ",null,null,0]
[null,null,null,null," ",null,null,0]
[null,null,null,null," ",null,null,0]
[null,null,null,null," ",null,null,0]
[null,null,null,null," ",null,null,0]
[null,null,null,null," ",null,null,0]
[null,null,null,null," ",null,null,0]
[null,null,null,null," ",null,null,0]
[null,null,null,null," ",null,null,0]
[null,null,null,null," ",null,null,0]
[null,null,null,null," ",null,null,0]
[null,null,null,null," ",null,null,0]
[null,null,null,null," ",null,null,0]
[null,null,null,null," ",null,null,0]
[null,null,null,null," ",null,null,0]
[null,null,null,null," ",null,null,0]
[null,null,null,null," ",null,null,0]
[null,null,null,null," ",null,null,0]
[null,null,null,null," ",null,null,0]
[null,null,null,null," ",null,null,0]
[null,null,null,null," ",null,null,0]
[null,null,null,null," ",null,null,0]
[null,null,null,null," ",null,null,0]
[null,null,null,null," ",null,null,0]
[null,null,null,null," ",null,null,0]
[null,null,null,null," ",null,null,0]
[null,null,null,null," ",null,null,0]
[null,null,null,null," ",null,null,0]
[null,null,null,null," ",null,null,0]
[null,null,null,null," ",null,null,0]
[null,null,null,null," ",null,null,0]
[null,null,null,null," ",null,null,0]
[null,null,null,null," ",null,null,0]
[null,null,null,null," ",null,null,0]
[null,null,null,null," ",null,null,0]
[null,null,null,null," ",null,null,0]
[null,null,null,null," ",null,null,0]
[null,null,null,null," ",null,null,0]
[null,null,null,null," ",null,null,0]
[null,null,null,null," ",null,null,0]
[null,null,null,null," ",null,null,0]
[null,null,null,null," ",null,null,0]
[null,null,null,null," ",null,null,0]
[null,null,null,null," ",null,null,0]
[null,null,null,null," ",null,null,0]
[null,null,null,null," ",null,null,0]
[null,null,null,null," ",null,null,0]
[null,null,null,null," ",null,null,0]
[null,null,null,null," ",null,null,0]
[null,null,null,null," ",null,null,0]
[null,null,null,null," ",null,null,0]
[null,null,null,null," ",null,null,0]
[null,null,null,null," ",null,null,0]
[null,null,null,null,{"$f":"IF(D137>0,VLOOKUP(D137,entidades,2,FALSE),\" \")","v":" "},null,null,{"$f":"+F137+G137","v":0}]
[null,null,null,null," ",null,null,0]
[null,null,null,null," ",null,null,0]
[null,null,null,null," ",null,null,0]
[null,null,null,null," ",null,null,0]
[null,null,null,null," ",null,null,0]
[null,null,null,null," ",null,null,0]
[null,null,null,null," ",null,null,0]
[null,null,null,null," ",null,null,0]
[null,null,null,null," ",null,null,0]
[null,null,null,null," ",null,null,0]
[null,null,null,null," ",null,null,0]
[null,null,null,null," ",null,null,0]
[null,null,null,null," ",null,null,0]
[null,null,null,null," ",null,null,0]
[null,null,null,null," ",null,null,0]
[null,null,null,null," ",null,null,0]
[null,null,null,null," ",null,null,0]
[null,null,null,null," ",null,null,0]
[null,null,null,null," ",null,null,0]
[null,null,null,null," ",null,null,0]
[null,null,null,null," ",null,null,0]
[null,null,null,null," ",null,null,0]
[null,null,null,null," ",null,null,0]
[null,null,null,null," ",null,null,0]
[null,null,null,null," ",null,null,0]
[null,null,null,null," ",null,null,0]
[null,null,null,null," ",null,null,0]
[null,null,null,null," ",null,null,0]
[null,null,null,null," ",null,null,0]
[null,null,null,null," ",null,null,0]
[null,null,null,null," ",null,null,0]
[null,null,null,null," ",null,null,0]
[null,null,null,null," ",null,null,0]
[null,null,null,null," ",null,null,0]
[null,null,null,null," ",null,null,0]
[null,null,null,null," ",null,null,0]
[null,null,null,null," ",null,null,0]
[null,null,null,null," ",null,null,0]
[null,null,null,null," ",null,null,0]
[null,null,null,null," ",null,null,0]
[null,null,null,null," ",null,null,0]
[null,null,null,null," ",null,null,0]
[null,null,null,null," ",null,null,0]
[null,null,null,null," ",null,null,0]
[null,null,null,null," ",null,null,0]
[null,null,null,null," ",null,null,0]
[null,null,null,null," ",null,null,0]
[null,null,null,null," ",null,null,0]
[null,null,null,null," ",null,null,0]
[null,null,null,null," ",null,null,0]
[null,null,null,null," ",null,null,0]
[null,null,null,null," ",null,null,0]
[null,null,null,null," ",null,null,0]
[null,null,null,null," ",null,null,0]
[null,null,null,null," ",null,null,0]
[null,null,null,null," ",null,null,0]
[null,null,null,null," ",null,null,0]
[null,null,null,null," ",null,null,0]
[null,null,null,null," ",null,null,0]
[null,null,null,null," ",null,null,0]
[null,null,null,null," ",null,null,0]
[null,null,null,null," ",null,null,0]
[null,null,null,null," ",null,null,0]
[null,null,null,null,{"$f":"IF(D201>0,VLOOKUP(D201,entidades,2,FALSE),\" \")","v":" "},null,null,{"$f":"+F201+G201","v":0}]
[null,null,null,null," ",null,null,0]
[null,null,null,null," ",null,null,0]
[null,null,null,null," ",null,null,0]
[null,null,null,null," ",null,null,0]
[null,null,null,null," ",null,null,0]
[null,null,null,null," ",null,null,0]
[null,null,null,null," ",null,null,0]
[null,null,null,null," ",null,null,0]
[null,null,null,null," ",null,null,0]
[null,null,null,null," ",null,null,0]
[null,null,null,null," ",null,null,0]
[null,null,null,null," ",null,null,0]
[null,null,null,null," ",null,null,0]
[null,null,null,null," ",null,null,0]
[null,null,null,null," ",null,null,0]
[null,null,null,null," ",null,null,0]
[null,null,null,null," ",null,null,0]
[null,null,null,null," ",null,null,0]
[null,null,null,null," ",null,null,0]
[null,null,null,null," ",null,null,0]
[null,null,null,null," ",null,null,0]
[null,null,null,null," ",null,null,0]
[null,null,null,null," ",null,null,0]
[null,null,null,null," ",null,null,0]
[null,null,null,null," ",null,null,0]
[null,null,null,null," ",null,null,0]
[null,null,null,null," ",null,null,0]
[null,null,null,null," ",null,null,0]
[null,null,null,null," ",null,null,0]
[null,null,null,null," ",null,null,0]
[null,null,null,null," ",null,null,0]
[null,null,null,null," ",null,null,0]
[null,null,null,null," ",null,null,0]
[null,null,null,null," ",null,null,0]
[null,null,null,null," ",null,null,0]
[null,null,null,null," ",null,null,0]
[null,null,null,null," ",null,null,0]
[null,null,null,null," ",null,null,0]
[null,null,null,null," ",null,null,0]
[null,null,null,null," ",null,null,0]
[null,null,null,null," ",null,null,0]
[null,null,null,null," ",null,null,0]
[null,null,null,null," ",null,null,0]
[null,null,null,null," ",null,null,0]
[null,null,null,null," ",null,null,0]
[null,null,null,null," ",null,null,0]
[null,null,null,null," ",null,null,0]
[null,null,null,null," ",null,null,0]
[null,null,null,null," ",null,null,0]
[null,null,null,null," ",null,null,0]
[null,null,null,null," ",null,null,0]
[null,null,null,null," ",null,null,0]
[null,null,null,null," ",null,null,0]
[null,null,null,null," ",null,null,0]
[null,null,null,null," ",null,null,0]
[null,null,null,null," ",null,null,0]
[null,null,null,null," ",null,null,0]
[null,null,null,null," ",null,null,0]
[null,null,null,null," ",null,null,0]
[null,null,null,null," ",null,null,0]
[null,null,null,null," ",null,null,0]
[null,null,null,null," ",null,null,0]
[null,null,null,null," ",null,null,0]
[null,null,null,null,{"$f":"IF(D265>0,VLOOKUP(D265,entidades,2,FALSE),\" \")","v":" "},null,null,{"$f":"+F265+G265","v":0}]
[null,null,null,null," ",null,null,0]
[null,null,null,null," ",null,null,0]
[null,null,null,null," ",null,null,0]
[null,null,null,null," ",null,null,0]
[null,null,null,null," ",null,null,0]
[null,null,null,null," ",null,null,0]
[null,null,null,null," ",null,null,0]
[null,null,null,null," ",null,null,0]
[null,null,null,null," ",null,null,0]
[null,null,null,null," ",null,null,0]
[null,null,null,null," ",null,null,0]
[null,null,null,null," ",null,null,0]
[null,null,null,null," ",null,null,0]
[null,null,null,null," ",null,null,0]
[null,null,null,null," ",null,null,0]
[null,null,null,null," ",null,null,0]
[null,null,null,null," ",null,null,0]
[null,null,null,null," ",null,null,0]
[null,null,null,null," ",null,null,0]
[null,null,null,null," ",null,null,0]
[null,null,null,null," ",null,null,0]
[null,null,null,null," ",null,null,0]
[null,null,null,null," ",null,null,0]
[null,null,null,null," ",null,null,0]
[null,null,null,null," ",null,null,0]
[null,null,null,null," ",null,null,0]
[null,null,null,null," ",null,null,0]
[null,null,null,null," ",null,null,0]
[null,null,null,null," ",null,null,0]
[null,null,null,null," ",null,null,0]
[null,null,null,null," ",null,null,0]
[null,null,null,null," ",null,null,0]
[null,null,null,null," ",null,null,0]
[null,null,null,null," ",null,null,0]
[null,null,null,null," ",null,null,0]
[null,null,null,null," ",null,null,0]
[null,null,null,null," ",null,null,0]
[null,null,null,null," ",null,null,0]
[null,null,null,null," ",null,null,0]
[null,null,null,null," ",null,null,0]
[null,null,null,null," ",null,null,0]
[null,null,null,null," ",null,null,0]
[null,null,null,null," ",null,null,0]
[null,null,null,null," ",null,null,0]
[null,null,null,null," ",null,null,0]
[null,null,null,null," ",null,null,0]
[null,null,null,null," ",null,null,0]
[null,null,null,null," ",null,null,0]
[null,null,null,null," ",null,null,0]
[null,null,null,null," ",null,null,0]
[null,null,null,null," ",null,null,0]
[null,null,null,null," ",null,null,0]
[null,null,null,null," ",null,null,0]
[null,null,null,null," ",null,null,0]
[null,null,null,null," ",null,null,0]
[null,null,null,null," ",null,null,0]
[null,null,null,null," ",null,null,0]
[null,null,null,null," ",null,null,0]
[null,null,null,null," ",null,null,0]
[null,null,null,null," ",null,null,0]
[null,null,null,null," ",null,null,0]
[null,null,null,null," ",null,null,0]
[null,null,null,null," ",null,null,0]
[null,null,null,null,{"$f":"IF(D329>0,VLOOKUP(D329,entidades,2,FALSE),\" \")","v":" "},null,null,{"$f":"+F329+G329","v":0}]
[null,null,null,null," ",null,null,0]
[null,null,null,null," ",null,null,0]
[null,null,null,null," ",null,null,0]
[null,null,null,null," ",null,null,0]
[null,null,null,null," ",null,null,0]
[null,null,null,null," ",null,null,0]
[null,null,null,null," ",null,null,0]
[null,null,null,null," ",null,null,0]
[null,null,null,null," ",null,null,0]
[null,null,null,null," ",null,null,0]
[null,null,null,null," ",null,null,0]
[null,null,null,null," ",null,null,0]
[null,null,null,null," ",null,null,0]
[null,null,null,null," ",null,null,0]
[null,null,null,null," ",null,null,0]
[null,null,null,null," ",null,null,0]
[null,null,null,null," ",null,null,0]
[null,null,null,null," ",null,null,0]
[null,null,null,null," ",null,null,0]
[null,null,null,null," ",null,null,0]
[null,null,null,null," ",null,null,0]
[null,null,null,null," ",null,null,0]
[null,null,null,null," ",null,null,0]
[null,null,null,null," ",null,null,0]
[null,null,null,null," ",null,null,0]
[null,null,null,null," ",null,null,0]
[null,null,null,null," ",null,null,0]
[null,null,null,null," ",null,null,0]
[null,null,null,null," ",null,null,0]
[null,null,null,null," ",null,null,0]
[null,null,null,null," ",null,null,0]
[null,null,null,null," ",null,null,0]
[null,null,null,null," ",null,null,0]
[null,null,null,null," ",null,null,0]
[null,null,null,null," ",null,null,0]
[null,null,null,null," ",null,null,0]
[null,null,null,null," ",null,null,0]
[null,null,null,null," ",null,null,0]
[null,null,null,null," ",null,null,0]
[null,null,null,null," ",null,null,0]
[null,null,null,null," ",null,null,0]
[null,null,null,null," ",null,null,0]
[null,null,null,null," ",null,null,0]
[null,null,null,null," ",null,null,0]
[null,null,null,null," ",null,null,0]
[null,null,null,null," ",null,null,0]
[null,null,null,null," ",null,null,0]
[null,null,null,null," ",null,null,0]
[null,null,null,null," ",null,null,0]
[null,null,null,null," ",null,null,0]
[null,null,null,null," ",null,null,0]
[null,null,null,null," ",null,null,0]
[null,null,null,null," ",null,null,0]
[null,null,null,null," ",null,null,0]
[null,null,null,null," ",null,null,0]
[null,null,null,null," ",null,null,0]
[null,null,null,null," ",null,null,0]
[null,null,null,null," ",null,null,0]
[null,null,null,null," ",null,null,0]
[null,null,null,null," ",null,null,0]
[null,null,null,null," ",null,null,0]
[null,null,null,null," ",null,null,0]
[null,null,null,null," ",null,null,0]
[null,null,null,null,{"$f":"IF(D393>0,VLOOKUP(D393,entidades,2,FALSE),\" \")","v":" "},null,null,{"$f":"+F393+G393","v":0}]
[null,null,null,null," ",null,null,0]
[null,null,null,null," ",null,null,0]
[null,null,null,null," ",null,null,0]
[null,null,null,null," ",null,null,0]
[null,null,null,null," ",null,null,0]
[null,null,null,null," ",null,null,0]
[null,null,null,null," ",null,null,0]
[null,null,null,null," ",null,null,0]
[null,null,null,null," ",null,null,0]
[null,null,null,null," ",null,null,0]
[null,null,null,null," ",null,null,0]
[null,null,null,null," ",null,null,0]
[null,null,null,null," ",null,null,0]
[null,null,null,null," ",null,null,0]
[null,null,null,null," ",null,null,0]
[null,null,null,null," ",null,null,0]
[null,null,null,null," ",null,null,0]
[null,null,null,null," ",null,null,0]
[null,null,null,null," ",null,null,0]
[null,null,null,null," ",null,null,0]
[null,null,null,null," ",null,null,0]
[null,null,null,null," ",null,null,0]
[null,null,null,null," ",null,null,0]
[null,null,null,null," ",null,null,0]
[null,null,null,null," ",null,null,0]
[null,null,null,null," ",null,null,0]
[null,null,null,null," ",null,null,0]
[null,null,null,null," ",null,null,0]
[null,null,null,null," ",null,null,0]
[null,null,null,null," ",null,null,0]
[null,null,null,null," ",null,null,0]
[null,null,null,null," ",null,null,0]
[null,null,null,null," ",null,null,0]
[null,null,null,null," ",null,null,0]
[null,null,null,null," ",null,null,0]
[null,null,null,null," ",null,null,0]
[null,null,null,null," ",null,null,0]
[null,null,null,null," ",null,null,0]
[null,null,null,null," ",null,null,0]
[null,null,null,null," ",null,null,0]
[null,null,null,null," ",null,null,0]
[null,null,null,null," ",null,null,0]
[null,null,null,null," ",null,null,0]
[null,null,null,null," ",null,null,0]
[null,null,null,null," ",null,null,0]
[null,null,null,null," ",null,null,0]
[null,null,null,null," ",null,null,0]
[null,null,null,null," ",null,null,0]
[null,null,null,null," ",null,null,0]
[null,null,null,null," ",null,null,0]
[null,null,null,null," ",null,null,0]
[null,null,null,null," ",null,null,0]
[null,null,null,null," ",null,null,0]
[null,null,null,null," ",null,null,0]
[null,null,null,null," ",null,null,0]
[null,null,null,null," ",null,null,0]
[null,null,null,null," ",null,null,0]
[null,null,null,null," ",null,null,0]
[null,null,null,null," ",null,null,0]
[null,null,null,null," ",null,null,0]
[null,null,null,null," ",null,null,0]
[null,null,null,null," ",null,null,0]
[null,null,null,null," ",null,null,0]
[null,null,null,null,{"$f":"IF(D457>0,VLOOKUP(D457,entidades,2,FALSE),\" \")","v":" "},null,null,{"$f":"+F457+G457","v":0}]
[null,null,null,null," ",null,null,0]
[null,null,null,null," ",null,null,0]
[null,null,null,null," ",null,null,0]
[null,null,null,null," ",null,null,0]
[null,null,null,null," ",null,null,0]
[null,null,null,null," ",null,null,0]
[null,null,null,null," ",null,null,0]
[null,null,null,null," ",null,null,0]
[null,null,null,null," ",null,null,0]
[null,null,null,null," ",null,null,0]
[null,null,null,null," ",null,null,0]
[null,null,null,null," ",null,null,0]
[null,null,null,null," ",null,null,0]
[null,null,null,null," ",null,null,0]
[null,null,null,null," ",null,null,0]
[null,null,null,null," ",null,null,0]
[null,null,null,null," ",null,null,0]
[null,null,null,null," ",null,null,0]
[null,null,null,null," ",null,null,0]
[null,null,null,null," ",null,null,0]
[null,null,null,null," ",null,null,0]
[null,null,null,null," ",null,null,0]
[null,null,null,null," ",null,null,0]
[null,null,null,null," ",null,null,0]
[null,null,null,null," ",null,null,0]
[null,null,null,null," ",null,null,0]
[null,null,null,null," ",null,null,0]
[null,null,null,null," ",null,null,0]
[null,null,null,null," ",null,null,0]
[null,null,null,null," ",null,null,0]
[null,null,null,null," ",null,null,0]
[null,null,null,null," ",null,null,0]
[null,null,null,null," ",null,null,0]
[null,null,null,null," ",null,null,0]
[null,null,null,null," ",null,null,0]
[null,null,null,null," ",null,null,0]
[null,null,null,null," ",null,null,0]
[null,null,null,null," ",null,null,0]
[null,null,null,null," ",null,null,0]
[null,null,null,null," ",null,null,0]
[null,null,null,null," ",null,null,0]
[null,null,null,null," ",null,null,0]
[null,null,null,null," ",null,null,0]
[null,null,null,null," ",null,null,0]
[null,null,null,null," ",null,null,0]
[null,null,null,null," ",null,null,0]
[null,null,null,null," ",null,null,0]
[null,null,null,null," ",null,null,0]
[null,null,null,null," ",null,null,0]
[null,null,null,null," ",null,null,0]
[null,null,null,null," ",null,null,0]
[null,null,null,null," ",null,null,0]
[null,null,null,null," ",null,null,0]
[null,null,null,null," ",null,null,0]
[null,null,null,null," ",null,null,0]
[null,null,null,null," ",null,null,0]
[null,null,null,null," ",null,null,0]
[null,null,null,null," ",null,null,0]
[null,null,null,null," ",null,null,0]
[null,null,null,null," ",null,null,0]
[null,null,null,null," ",null,null,0]
[null,null,null,null," ",null,null,0]
[null,null,null,null," ",null,null,0]
[null,null,null,null,{"$f":"IF(D521>0,VLOOKUP(D521,entidades,2,FALSE),\" \")","v":" "},null,null,{"$f":"+F521+G521","v":0}]
[null,null,null,null," ",null,null,0]
[null,null,null,null," ",null,null,0]
[null,null,null,null," ",null,null,0]
[null,null,null,null," ",null,null,0]
[null,null,null,null," ",null,null,0]
[null,null,null,null," ",null,null,0]
[null,null,null,null," ",null,null,0]
[null,null,null,null," ",null,null,0]
[null,null,null,null," ",null,null,0]
[null,null,null,null," ",null,null,0]
[null,null,null,null," ",null,null,0]
[null,null,null,null," ",null,null,0]
[null,null,null,null," ",null,null,0]
[null,null,null,null," ",null,null,0]
[null,null,null,null," ",null,null,0]
[null,null,null,null," ",null,null,0]
[null,null,null,null," ",null,null,0]
[null,null,null,null," ",null,null,0]
[null,null,null,null," ",null,null,0]
[null,null,null,null," ",null,null,0]
[null,null,null,null," ",null,null,0]
[null,null,null,null," ",null,null,0]
[null,null,null,null," ",null,null,0]
[null,null,null,null," ",null,null,0]
[null,null,null,null," ",null,null,0]
[null,null,null,null," ",null,null,0]
[null,null,null,null," ",null,null,0]
[null,null,null,null," ",null,null,0]
[null,null,null,null," ",null,null,0]
[null,null,null,null," ",null,null,0]
[null,null,null,null," ",null,null,0]
[null,null,null,null," ",null,null,0]
[null,null,null,null," ",null,null,0]
[null,null,null,null," ",null,null,0]
[null,null,null,null," ",null,null,0]
[null,null,null,null," ",null,null,0]
[null,null,null,null," ",null,null,0]
[null,null,null,null," ",null,null,0]
[null,null,null,null," ",null,null,0]
[null,null,null,null," ",null,null,0]
[null,null,null,null," ",null,null,0]
[null,null,null,null," ",null,null,0]
[null,null,null,null," ",null,null,0]
[null,null,null,null," ",null,null,0]
[null,null,null,null," ",null,null,0]
[null,null,null,null," ",null,null,0]
[null,null,null,null," ",null,null,0]
[null,null,null,null," ",null,null,0]
[null,null,null,null," ",null,null,0]
[null,null,null,null," ",null,null,0]
[null,null,null,null," ",null,null,0]
[null,null,null,null," ",null,null,0]
[null,null,null,null," ",null,null,0]
[null,null,null,null," ",null,null,0]
[null,null,null,null," ",null,null,0]
[null,null,null,null," ",null,null,0]
[null,null,null,null," ",null,null,0]
[null,null,null,null," ",null,null,0]
[null,null,null,null," ",null,null,0]
[null,null,null,null," ",null,null,0]
[null,null,null,null," ",null,null,0]
[null,null,null,null," ",null,null,0]
[null,null,null,null," ",null,null,0]
[null,null,null,null,{"$f":"IF(D585>0,VLOOKUP(D585,entidades,2,FALSE),\" \")","v":" "},null,null,{"$f":"+F585+G585","v":0}]
[null,null,null,null," ",null,null,0]
[null,null,null,null," ",null,null,0]
[null,null,null,null," ",null,null,0]
[null,null,null,null," ",null,null,0]
[null,null,null,null," ",null,null,0]
[null,null,null,null," ",null,null,0]
[null,null,null,null," ",null,null,0]
[null,null,null,null," ",null,null,0]
[null,null,null,null," ",null,null,0]
[null,null,null,null," ",null,null,0]
[null,null,null,null," ",null,null,0]
[null,null,null,null," ",null,null,0]
[null,null,null,null," ",null,null,0]
[null,null,null,null," ",null,null,0]
[null,null,null,null," ",null,null,0]
[null,null,null,null," ",null,null,0]
[null,null,null,null," ",null,null,0]
[null,null,null,null," ",null,null,0]
[null,null,null,null," ",null,null,0]
[null,null,null,null," ",null,null,0]
[null,null,null,null," ",null,null,0]
[null,null,null,null," ",null,null,0]
[null,null,null,null," ",null,null,0]
[null,null,null,null," ",null,null,0]
[null,null,null,null," ",null,null,0]
[null,null,null,null," ",null,null,0]
[null,null,null,null," ",null,null,0]
[null,null,null,null," ",null,null,0]
[null,null,null,null," ",null,null,0]
[null,null,null,null," ",null,null,0]
[null,null,null,null," ",null,null,0]
[null,null,null,null," ",null,null,0]
[null,null,null,null," ",null,null,0]
[null,null,null,null," ",null,null,0]
[null,null,null,null," ",null,null,0]
[null,null,null,null," ",null,null,0]
[null,null,null,null," ",null,null,0]
[null,null,null,null," ",null,null,0]
[null,null,null,null," ",null,null,0]
[null,null,null,null," ",null,null,0]
[null,null,null,null," ",null,null,0]
[null,null,null,null," ",null,null,0]
[null,null,null,null," ",null,null,0]
[null,null,null,null," ",null,null,0]
[null,null,null,null," ",null,null,0]
[null,null,null,null," ",null,null,0]
[null,null,null,null," ",null,null,0]
[null,null,null,null," ",null,null,0]
[null,null,null,null," ",null,null,0]
[null,null,null,null," ",null,null,0]
[null,null,null,null," ",null,null,0]
[null,null,null,null," ",null,null,0]
[null,null,null,null," ",null,null,0]
[null,null,null,null," ",null,null,0]
[null,null,null,null," ",null,null,0]
[null,null,null,null," ",null,null,0]
[null,null,null,null," ",null,null,0]
[null,null,null,null," ",null,null,0]
[null,null,null,null," ",null,null,0]
[null,null,null,null," ",null,null,0]
[null,null,null,null," ",null,null,0]
[null,null,null,null," ",null,null,0]
[null,null,null,null," ",null,null,0]
[null,null,null,null,{"$f":"IF(D649>0,VLOOKUP(D649,entidades,2,FALSE),\" \")","v":" "},null,null,{"$f":"+F649+G649","v":0}]
[null,null,null,null," ",null,null,0]
[null,null,null,null," ",null,null,0]
[null,null,null,null," ",null,null,0]
[null,null,null,null," ",null,null,0]
[null,null,null,null," ",null,null,0]
[null,null,null,null," ",null,null,0]
[null,null,null,null," ",null,null,0]
[null,null,null,null," ",null,null,0]
[null,null,null,null," ",null,null,0]
[null,null,null,null," ",null,null,0]
[null,null,null,null," ",null,null,0]
[null,null,null,null," ",null,null,0]
[null,null,null,null," ",null,null,0]
[null,null,null,null," ",null,null,0]
[null,null,null,null," ",null,null,0]
[null,null,null,null," ",null,null,0]
[null,null,null,null," ",null,null,0]
[null,null,null,null," ",null,null,0]
[null,null,null,null," ",null,null,0]
[null,null,null,null," ",null,null,0]
[null,null,null,null," ",null,null,0]
[null,null,null,null," ",null,null,0]
[null,null,null,null," ",null,null,0]
[null,null,null,null," ",null,null,0]
[null,null,null,null," ",null,null,0]
[null,null,null,null," ",null,null,0]
[null,null,null,null," ",null,null,0]
[null,null,null,null," ",null,null,0]
[null,null,null,null," ",null,null,0]
[null,null,null,null," ",null,null,0]
[null,null,null,null," ",null,null,0]
[null,null,null,null," ",null,null,0]
[null,null,null,null," ",null,null,0]
[null,null,null,null," ",null,null,0]
[null,null,null,null," ",null,null,0]
[null,null,null,null," ",null,null,0]
[null,null,null,null," ",null,null,0]
[null,null,null,null," ",null,null,0]
[null,null,null,null," ",null,null,0]
[null,null,null,null," ",null,null,0]
[null,null,null,null," ",null,null,0]
[null,null,null,null," ",null,null,0]
[null,null,null,null," ",null,null,0]
[null,null,null,null," ",null,null,0]
[null,null,null,null," ",null,null,0]
[null,null,null,null," ",null,null,0]
[null,null,null,null," ",null,null,0]
[null,null,null,null," ",null,null,0]
[null,null,null,null," ",null,null,0]
[null,null,null,null," ",null,null,0]
[null,null,null,null," ",null,null,0]
[null,null,null,null," ",null,null,0]
[null,null,null,null," ",null,null,0]
[null,null,null,null," ",null,null,0]
[null,null,null,null," ",null,null,0]
[null,null,null,null," ",null,null,0]
[null,null,null,null," ",null,null,0]
[null,null,null,null," ",null,null,0]
[null,null,null,null," ",null,null,0]
[null,null,null,null," ",null,null,0]
[null,null,null,null," ",null,null,0]
[null,null,null,null," ",null,null,0]
[null,null,null,null," ",null,null,0]
[null,null,null,null,{"$f":"IF(D713>0,VLOOKUP(D713,entidades,2,FALSE),\" \")","v":" "},null,null,{"$f":"+F713+G713","v":0}]
[null,null,null,null," ",null,null,0]
[null,null,null,null," ",null,null,0]
[null,null,null,null," ",null,null,0]
[null,null,null,null," ",null,null,0]
[null,null,null,null," ",null,null,0]
[null,null,null,null," ",null,null,0]
[null,null,null,null," ",null,null,0]
[null,null,null,null," ",null,null,0]
[null,null,null,null," ",null,null,0]
[null,null,null,null," ",null,null,0]
[null,null,null,null," ",null,null,0]
[null,null,null,null," ",null,null,0]
[null,null,null,null," ",null,null,0]
[null,null,null,null," ",null,null,0]
[null,null,null,null," ",null,null,0]
[null,null,null,null," ",null,null,0]
[null,null,null,null," ",null,null,0]
[null,null,null,null," ",null,null,0]
[null,null,null,null," ",null,null,0]
[null,null,null,null," ",null,null,0]
[null,null,null,null," ",null,null,0]
[null,null,null,null," ",null,null,0]
[null,null,null,null," ",null,null,0]
[null,null,null,null," ",null,null,0]
[null,null,null,null," ",null,null,0]
[null,null,null,null," ",null,null,0]
[null,null,null,null," ",null,null,0]
[null,null,null,null," ",null,null,0]
[null,null,null,null," ",null,null,0]
[null,null,null,null," ",null,null,0]
[null,null,null,null," ",null,null,0]
[null,null,null,null," ",null,null,0]
[null,null,null,null," ",null,null,0]
[null,null,null,null," ",null,null,0]
[null,null,null,null," ",null,null,0]
[null,null,null,null," ",null,null,0]
[null,null,null,null," ",null,null,0]
[null,null,null,null," ",null,null,0]
[null,null,null,null," ",null,null,0]
[null,null,null,null," ",null,null,0]
[null,null,null,null," ",null,null,0]
[null,null,null,null," ",null,null,0]
[null,null,null,null," ",null,null,0]
[null,null,null,null," ",null,null,0]
[null,null,null,null," ",null,null,0]
[null,null,null,null," ",null,null,0]
[null,null,null,null," ",null,null,0]
[null,null,null,null," ",null,null,0]
[null,null,null,null," ",null,null,0]
[null,null,null,null," ",null,null,0]
[null,null,null,null," ",null,null,0]
[null,null,null,null," ",null,null,0]
[null,null,null,null," ",null,null,0]
[null,null,null,null," ",null,null,0]
[null,null,null,null," ",null,null,0]
[null,null,null,null," ",null,null,0]
[null,null,null,null," ",null,null,0]
[null,null,null,null," ",null,null,0]
[null,null,null,null," ",null,null,0]
[null,null,null,null," ",null,null,0]
[null,null,null,null," ",null,null,0]
[null,null,null,null," ",null,null,0]
[null,null,null,null," ",null,null,0]
[null,null,null,null,{"$f":"IF(D777>0,VLOOKUP(D777,entidades,2,FALSE),\" \")","v":" "},null,null,{"$f":"+F777+G777","v":0}]
[null,null,null,null," ",null,null,0]
[null,null,null,null," ",null,null,0]
[null,null,null,null," ",null,null,0]
[null,null,null,null," ",null,null,0]
[null,null,null,null," ",null,null,0]
[null,null,null,null," ",null,null,0]
[null,null,null,null," ",null,null,0]
[null,null,null,null," ",null,null,0]
[null,null,null,null," ",null,null,0]
[null,null,null,null," ",null,null,0]
[null,null,null,null," ",null,null,0]
[null,null,null,null," ",null,null,0]
[null,null,null,null," ",null,null,0]
[null,null,null,null," ",null,null,0]
[null,null,null,null," ",null,null,0]
[null,null,null,null," ",null,null,0]
[null,null,null,null," ",null,null,0]
[null,null,null,null," ",null,null,0]
[null,null,null,null," ",null,null,0]
[null,null,null,null," ",null,null,0]
[null,null,null,null," ",null,null,0]
[null,null,null,null," ",null,null,0]
[null,null,null,null," ",null,null,0]
[null,null,null,null," ",null,null,0]
[null,null,null,null," ",null,null,0]
[null,null,null,null," ",null,null,0]
[null,null,null,null," ",null,null,0]
[null,null,null,null," ",null,null,0]
[null,null,null,null," ",null,null,0]
[null,null,null,null," ",null,null,0]
[null,null,null,null," ",null,null,0]
[null,null,null,null," ",null,null,0]
[null,null,null,null," ",null,null,0]
[null,null,null,null," ",null,null,0]
[null,null,null,null," ",null,null,0]
[null,null,null,null," ",null,null,0]
[null,null,null,null," ",null,null,0]
[null,null,null,null," ",null,null,0]
[null,null,null,null," ",null,null,0]
[null,null,null,null," ",null,null,0]
[null,null,null,null," ",null,null,0]
[null,null,null,null," ",null,null,0]
[null,null,null,null," ",null,null,0]
[null,null,null,null," ",null,null,0]
[null,null,null,null," ",null,null,0]
[null,null,null,null," ",null,null,0]
[null,null,null,null," ",null,null,0]
[null,null,null,null," ",null,null,0]
[null,null,null,null," ",null,null,0]
[null,null,null,null," ",null,null,0]
[null,null,null,null," ",null,null,0]
[null,null,null,null," ",null,null,0]
[null,null,null,null," ",null,null,0]
[null,null,null,null," ",null,null,0]
[null,null,null,null," ",null,null,0]
[null,null,null,null," ",null,null,0]
[null,null,null,null," ",null,null,0]
[null,null,null,null," ",null,null,0]
[null,null,null,null," ",null,null,0]
[null,null,null,null," ",null,null,0]
[null,null,null,null," ",null,null,0]
[null,null,null,null," ",null,null,0]
[null,null,null,null," ",null,null,0]
[null,null,null,null,{"$f":"IF(D841>0,VLOOKUP(D841,entidades,2,FALSE),\" \")","v":" "},null,null,{"$f":"+F841+G841","v":0}]
[null,null,null,null," ",null,null,0]
[null,null,null,null," ",null,null,0]
[null,null,null,null," ",null,null,0]
[null,null,null,null," ",null,null,0]
[null,null,null,null," ",null,null,0]
[null,null,null,null," ",null,null,0]
[null,null,null,null," ",null,null,0]
[null,null,null,null," ",null,null,0]
[null,null,null,null," ",null,null,0]
[null,null,null,null," ",null,null,0]
[null,null,null,null," ",null,null,0]
[null,null,null,null," ",null,null,0]
[null,null,null,null," ",null,null,0]
[null,null,null,null," ",null,null,0]
[null,null,null,null," ",null,null,0]
[null,null,null,null," ",null,null,0]
[null,null,null,null," ",null,null,0]
[null,null,null,null," ",null,null,0]
[null,null,null,null," ",null,null,0]
[null,null,null,null," ",null,null,0]
[null,null,null,null," ",null,null,0]
[null,null,null,null," ",null,null,0]
[null,null,null,null," ",null,null,0]
[null,null,null,null," ",null,null,0]
[null,null,null,null," ",null,null,0]
[null,null,null,null," ",null,null,0]
[null,null,null,null," ",null,null,0]
[null,null,null,null," ",null,null,0]
[null,null,null,null," ",null,null,0]
[null,null,null,null," ",null,null,0]
[null,null,null,null," ",null,null,0]
[null,null,null,null," ",null,null,0]
[null,null,null,null," ",null,null,0]
[null,null,null,null," ",null,null,0]
[null,null,null,null," ",null,null,0]
[null,null,null,null," ",null,null,0]
[null,null,null,null," ",null,null,0]
[null,null,null,null," ",null,null,0]
[null,null,null,null," ",null,null,0]
[null,null,null,null," ",null,null,0]
[null,null,null,null," ",null,null,0]
[null,null,null,null," ",null,null,0]
[null,null,null,null," ",null,null,0]
[null,null,null,null," ",null,null,0]
[null,null,null,null," ",null,null,0]
[null,null,null,null," ",null,null,0]
[null,null,null,null," ",null,null,0]
[null,null,null,null," ",null,null,0]
[null,null,null,null," ",null,null,0]
[null,null,null,null," ",null,null,0]
[null,null,null,null," ",null,null,0]
[null,null,null,null," ",null,null,0]
[null,null,null,null," ",null,null,0]
[null,null,null,null," ",null,null,0]
[null,null,null,null," ",null,null,0]
[null,null,null,null," ",null,null,0]
[null,null,null,null," ",null,null,0]
[null,null,null,null," ",null,null,0]
[null,null,null,null," ",null,null,0]
[null,null,null,null," ",null,null,0]
[null,null,null,null," ",null,null,0]
[null,null,null,null," ",null,null,0]
[null,null,null,null," ",null,null,0]
[null,null,null,null,{"$f":"IF(D905>0,VLOOKUP(D905,entidades,2,FALSE),\" \")","v":" "},null,null,{"$f":"+F905+G905","v":0}]
[null,null,null,null," ",null,null,0]
[null,null,null,null," ",null,null,0]
[null,null,null,null," ",null,null,0]
[null,null,null,null," ",null,null,0]
[null,null,null,null," ",null,null,0]
[null,null,null,null," ",null,null,0]
[null,null,null,null," ",null,null,0]
[null,null,null,null," ",null,null,0]
[null,null,null,null," ",null,null,0]
[null,null,null,null," ",null,null,0]
[null,null,null,null," ",null,null,0]
[null,null,null,null," ",null,null,0]
[null,null,null,null," ",null,null,0]
[null,null,null,null," ",null,null,0]
[null,null,null,null," ",null,null,0]
[null,null,null,null," ",null,null,0]
[null,null,null,null," ",null,null,0]
[null,null,null,null," ",null,null,0]
[null,null,null,null," ",null,null,0]
[null,null,null,null," ",null,null,0]
[null,null,null,null," ",null,null,0]
[null,null,null,null," ",null,null,0]
[null,null,null,null," ",null,null,0]
[null,null,null,null," ",null,null,0]
[null,null,null,null," ",null,null,0]
[null,null,null,null," ",null,null,0]
[null,null,null,null," ",null,null,0]
[null,null,null,null," ",null,null,0]
[null,null,null,null," ",null,null,0]
[null,null,null,null," ",null,null,0]
[null,null,null,null," ",null,null,0]
[null,null,null,null," ",null,null,0]
[null,null,null,null," ",null,null,0]
[null,null,null,null," ",null,null,0]
[null,null,null,null," ",null,null,0]
[null,null,null,null," ",null,null,0]
[null,null,null,null," ",null,null,0]
[null,null,null,null," ",null,null,0]
[null,null,null,null," ",null,null,0]
[null,null,null,null," ",null,null,0]
[null,null,null,null," ",null,null,0]
[null,null,null,null," ",null,null,0]
[null,null,null,null," ",null,null,0]
[null,null,null,null," ",null,null,0]
[null,null,null,null," ",null,null,0]
[null,null,null,null," ",null,null,0]
[null,null,null,null," ",null,null,0]
[null,null,null,null," ",null,null,0]
[null,null,null,null," ",null,null,0]
[null,null,null,null," ",null,null,0]
[null,null,null,null," ",null,null,0]
[null,null,null,null," ",null,null,0]
[null,null,null,null," ",null,null,0]
[null,null,null,null," ",null,null,0]
[null,null,null,null," ",null,null,0]
[null,null,null,null," ",null,null,0]
[null,null,null,null," ",null,null,0]
[null,null,null,null," ",null,null,0]
[null,null,null,null," ",null,null,0]
[null,null,null,null," ",null,null,0]
[null,null,null,null," ",null,null,0]
[null,null,null,null," ",null,null,0]
[null,null,null,null," ",null,null,0]
[null,null,null,null,{"$f":"IF(D969>0,VLOOKUP(D969,entidades,2,FALSE),\" \")","v":" "},null,null,{"$f":"+F969+G969","v":0}]
[null,null,null,null," ",null,null,0]
[null,null,null,null," ",null,null,0]
[null,null,null,null," ",null,null,0]
[null,null,null,null," ",null,null,0]
[null,null,null,null," ",null,null,0]
[null,null,null,null," ",null,null,0]
[null,null,null,null," ",null,null,0]
[null,null,null,null," ",null,null,0]
[null,null,null,null," ",null,null,0]
[null,null,null,null," ",null,null,0]
[null,null,null,null," ",null,null,0]
[null,null,null,null," ",null,null,0]
[null,null,null,null," ",null,null,0]
[null,null,null,null," ",null,null,0]
[null,null,null,null," ",null,null,0]
[null,null,null,null," ",null,null,0]
[null,null,null,null," ",null,null,0]
[null,null,null,null," ",null,null,0]
[null,null,null,null," ",null,null,0]
[null,null,null,null," ",null,null,0]
[null,null,null,null," ",null,null,0]
[null,null,null,null," ",null,null,0]
[null,null,null,null," ",null,null,0]
[null,null,null,null," ",null,null,0]
[null,null,null,null," ",null,null,0]
[null,null,null,null," ",null,null,0]
[null,null,null,null," ",null,null,0]
[null,null,null,null," ",null,null,0]
[null,null,null,null," ",null,null,0]
[null,null,null,null," ",null,null,0]
[null,null,null,null," ",null,null,0]
[null,null,null,null," ",null,null,0]
[null,null,null,null," ",null,null,0]
[null,null,null,null," ",null,null,0]
[null,null,null,null," ",null,null,0]
[null,null,null,null," ",null,null,0]
[null,null,null,null," ",null,null,0]
[null,null,null,null," ",null,null,0]
[null,null,null,null," ",null,null,0]
[null,null,null,null," ",null,null,0]
[null,null,null,null," ",null,null,0]
[null,null,null,null," ",null,null,0]
[null,null,null,null," ",null,null,0]
[null,null,null,null," ",null,null,0]
[null,null,null,null," ",null,null,0]
[null,null,null,null," ",null,null,0]
[null,null,null,null," ",null,null,0]
[null,null,null,null," ",null,null,0]
[null,null,null,null," ",null,null,0]
[null,null,null,null," ",null,null,0]
[null,null,null,null," ",null,null,0]
[null,null,null,null," ",null,null,0]
[null,null,null,null," ",null,null,0]
[null,null,null,null," ",null,null,0]
[null,null,null,null," ",null,null,0]
[null,null,null,null," ",null,null,0]
[null,null,null,null," ",null,null,0]
[null,null,null,null," ",null,null,0]
[null,null,null,null," ",null,null,0]
[null,null,null,null," ",null,null,0]
[null,null,null,null," ",null,null,0]
[null,null,null,null," ",null,null,0]
[null,null,null,null," ",null,null,0]
[null,null,null,null,{"$f":"IF(D1033>0,VLOOKUP(D1033,entidades,2,FALSE),\" \")","v":" "},null,null,{"$f":"+F1033+G1033","v":0}]
[null,null,null,null," ",null,null,0]
[null,null,null,null," ",null,null,0]
[null,null,null,null," ",null,null,0]
[null,null,null,null," ",null,null,0]
[null,null,null,null," ",null,null,0]
[null,null,null,null," ",null,null,0]
[null,null,null,null," ",null,null,0]
[null,null,null,null," ",null,null,0]
[null,null,null,null," ",null,null,0]
[null,null,null,null," ",null,null,0]
[null,null,null,null," ",null,null,0]
[null,null,null,null," ",null,null,0]
[null,null,null,null," ",null,null,0]
[null,null,null,null," ",null,null,0]
[null,null,null,null," ",null,null,0]
[null,null,null,null," ",null,null,0]
[null,null,null,null," ",null,null,0]
[null,null,null,null," ",null,null,0]
[null,null,null,null," ",null,null,0]
[null,null,null,null," ",null,null,0]
[null,null,null,null," ",null,null,0]
[null,null,null,null," ",null,null,0]
[null,null,null,null," ",null,null,0]
[null,null,null,null," ",null,null,0]
[null,null,null,null," ",null,null,0]
[null,null,null,null," ",null,null,0]
[null,null,null,null," ",null,null,0]
[null,null,null,null," ",null,null,0]
[null,null,null,null," ",null,null,0]
[null,null,null,null," ",null,null,0]
[null,null,null,null," ",null,null,0]
[null,null,null,null," ",null,null,0]
[null,null,null,null," ",null,null,0]
[null,null,null,null," ",null,null,0]
[null,null,null,null," ",null,null,0]
[null,null,null,null," ",null,null,0]
[null,null,null,null," ",null,null,0]
[null,null,null,null," ",null,null,0]
[null,null,null,null," ",null,null,0]
[null,null,null,null," ",null,null,0]
[null,null,null,null," ",null,null,0]
[null,null,null,null," ",null,null,0]
[null,null,null,null," ",null,null,0]
[null,null,null,null," ",null,null,0]
[null,null,null,null," ",null,null,0]
[null,null,null,null," ",null,null,0]
[null,null,null,null," ",null,null,0]
[null,null,null,null," ",null,null,0]
[null,null,null,null," ",null,null,0]
[null,null,null,null," ",null,null,0]
[null,null,null,null," ",null,null,0]
[null,null,null,null," ",null,null,0]
[null,null,null,null," ",null,null,0]
[null,null,null,null," ",null,null,0]
[null,null,null,null," ",null,null,0]
[null,null,null,null," ",null,null,0]
[null,null,null,null," ",null,null,0]
[null,null,null,null," ",null,null,0]
[null,null,null,null," ",null,null,0]
[null,null,null,null," ",null,null,0]
[null,null,null,null," ",null,null,0]
[null,null,null,null," ",null,null,0]
[null,null,null,null," ",null,null,0]
[null,null,null,null,{"$f":"IF(D1097>0,VLOOKUP(D1097,entidades,2,FALSE),\" \")","v":" "},null,null,{"$f":"+F1097+G1097","v":0}]
[null,null,null,null," ",null,null,0]
[null,null,null,null," ",null,null,0]
[null,null,null,null," ",null,null,0]
[null,null,null,null," ",null,null,0]
[null,null,null,null," ",null,null,0]
[null,null,null,null," ",null,null,0]
[null,null,null,null," ",null,null,0]
[null,null,null,null," ",null,null,0]
[null,null,null,null," ",null,null,0]
[null,null,null,null," ",null,null,0]
[null,null,null,null," ",null,null,0]
[null,null,null,null," ",null,null,0]
[null,null,null,null," ",null,null,0]
[null,null,null,null," ",null,null,0]
[null,null,null,null," ",null,null,0]
[null,null,null,null," ",null,null,0]
[null,null,null,null," ",null,null,0]
[null,null,null,null," ",null,null,0]
[null,null,null,null," ",null,null,0]
[null,null,null,null," ",null,null,0]
[null,null,null,null," ",null,null,0]
[null,null,null,null," ",null,null,0]
[null,null,null,null," ",null,null,0]
[null,null,null,null," ",null,null,0]
[null,null,null,null," ",null,null,0]
[null,null,null,null," ",null,null,0]
[null,null,null,null," ",null,null,0]
[null,null,null,null," ",null,null,0]
[null,null,null,null," ",null,null,0]
[null,null,null,null," ",null,null,0]
[null,null,null,null," ",null,null,0]
[null,null,null,null," ",null,null,0]
[null,null,null,null," ",null,null,0]
[null,null,null,null," ",null,null,0]
[null,null,null,null," ",null,null,0]
[null,null,null,null," ",null,null,0]
[null,null,null,null," ",null,null,0]
[null,null,null,null," ",null,null,0]
[null,null,null,null," ",null,null,0]
[null,null,null,null," ",null,null,0]
[null,null,null,null," ",null,null,0]
[null,null,null,null," ",null,null,0]
[null,null,null,null," ",null,null,0]
[null,null,null,null," ",null,null,0]
[null,null,null,null," ",null,null,0]
[null,null,null,null," ",null,null,0]
[null,null,null,null," ",null,null,0]
[null,null,null,null," ",null,null,0]
[null,null,null,null," ",null,null,0]
[null,null,null,null," ",null,null,0]
[null,null,null,null," ",null,null,0]
[null,null,null,null," ",null,null,0]
[null,null,null,null," ",null,null,0]
[null,null,null,null," ",null,null,0]
[null,null,null,null," ",null,null,0]
[null,null,null,null," ",null,null,0]
[null,null,null,null," ",null,null,0]
[null,null,null,null," ",null,null,0]
[null,null,null,null," ",null,null,0]
[null,null,null,null," ",null,null,0]
[null,null,null,null," ",null,null,0]
[null,null,null,null," ",null,null,0]
[null,null,null,null," ",null,null,0]
[null,null,null,null,{"$f":"IF(D1161>0,VLOOKUP(D1161,entidades,2,FALSE),\" \")","v":" "},null,null,{"$f":"+F1161+G1161","v":0}]
[null,null,null,null," ",null,null,0]
[null,null,null,null," ",null,null,0]
[null,null,null,null," ",null,null,0]
[null,null,null,null," ",null,null,0]
[null,null,null,null," ",null,null,0]
[null,null,null,null," ",null,null,0]
[null,null,null,null," ",null,null,0]
[null,null,null,null," ",null,null,0]
[null,null,null,null," ",null,null,0]
[null,null,null,null," ",null,null,0]
[null,null,null,null," ",null,null,0]
[null,null,null,null," ",null,null,0]
[null,null,null,null," ",null,null,0]
[null,null,null,null," ",null,null,0]
[null,null,null,null," ",null,null,0]
[null,null,null,null," ",null,null,0]
[null,null,null,null," ",null,null,0]
[null,null,null,null," ",null,null,0]
[null,null,null,null," ",null,null,0]
[null,null,null,null," ",null,null,0]
[null,null,null,null," ",null,null,0]
[null,null,null,null," ",null,null,0]
[null,null,null,null," ",null,null,0]
[null,null,null,null," ",null,null,0]
[null,null,null,null," ",null,null,0]
[null,null,null,null," ",null,null,0]
[null,null,null,null," ",null,null,0]
[null,null,null,null," ",null,null,0]
[null,null,null,null," ",null,null,0]
[null,null,null,null," ",null,null,0]
[null,null,null,null," ",null,null,0]
[null,null,null,null," ",null,null,0]
[null,null,null,null," ",null,null,0]
[null,null,null,null," ",null,null,0]
[null,null,null,null," ",null,null,0]
[null,null,null,null," ",null,null,0]
[null,null,null,null," ",null,null,0]
[null,null,null,null," ",null,null,0]
[null,null,null,null," ",null,null,0]
[null,null,null,null," ",null,null,0]
[null,null,null,null," ",null,null,0]
[null,null,null,null," ",null,null,0]
[null,null,null,null," ",null,null,0]
[null,null,null,null," ",null,null,0]
[null,null,null,null," ",null,null,0]
[null,null,null,null," ",null,null,0]
[null,null,null,null," ",null,null,0]
[null,null,null,null," ",null,null,0]
[null,null,null,null," ",null,null,0]
[null,null,null,null," ",null,null,0]
[null,null,null,null," ",null,null,0]
[null,null,null,null," ",null,null,0]
[null,null,null,null," ",null,null,0]
[null,null,null,null," ",null,null,0]
[null,null,null,null," ",null,null,0]
[null,null,null,null," ",null,null,0]
[null,null,null,null," ",null,null,0]
[null,null,null,null," ",null,null,0]
[null,null,null,null," ",null,null,0]
[null,null,null,null," ",null,null,0]
[null,null,null,null," ",null,null,0]
[null,null,null,null," ",null,null,0]
[null,null,null,null," ",null,null,0]
[null,null,null,null,{"$f":"IF(D1225>0,VLOOKUP(D1225,entidades,2,FALSE),\" \")","v":" "},null,null,{"$f":"+F1225+G1225","v":0}]
[null,null,null,null," ",null,null,0]
[null,null,null,null," ",null,null,0]
[null,null,null,null," ",null,null,0]
[null,null,null,null," ",null,null,0]
[null,null,null,null," ",null,null,0]
[null,null,null,null," ",null,null,0]
[null,null,null,null," ",null,null,0]
[null,null,null,null," ",null,null,0]
[null,null,null,null," ",null,null,0]
[null,null,null,null," ",null,null,0]
[null,null,null,null," ",null,null,0]
[null,null,null,null," ",null,null,0]
[null,null,null,null," ",null,null,0]
[null,null,null,null," ",null,null,0]
[null,null,null,null," ",null,null,0]
[null,null,null,null," ",null,null,0]
[null,null,null,null," ",null,null,0]
[null,null,null,null," ",null,null,0]
[null,null,null,null," ",null,null,0]
[null,null,null,null," ",null,null,0]
[null,null,null,null," ",null,null,0]
[null,null,null,null," ",null,null,0]
[null,null,null,null," ",null,null,0]
[null,null,null,null," ",null,null,0]
[null,null,null,null," ",null,null,0]
[null,null,null,null," ",null,null,0]
[null,null,null,null," ",null,null,0]
[null,null,null,null," ",null,null,0]
[null,null,null,null," ",null,null,0]
[null,null,null,null," ",null,null,0]
[null,null,null,null," ",null,null,0]
[null,null,null,null," ",null,null,0]
[null,null,null,null," ",null,null,0]
[null,null,null,null," ",null,null,0]
[null,null,null,null," ",null,null,0]
[null,null,null,null," ",null,null,0]
[null,null,null,null," ",null,null,0]
[null,null,null,null," ",null,null,0]
[null,null,null,null," ",null,null,0]
[null,null,null,null," ",null,null,0]
[null,null,null,null," ",null,null,0]
[null,null,null,null," ",null,null,0]
[null,null,null,null," ",null,null,0]
[null,null,null,null," ",null,null,0]
[null,null,null,null," ",null,null,0]
[null,null,null,null," ",null,null,0]
[null,null,null,null," ",null,null,0]
[null,null,null,null," ",null,null,0]
[null,null,null,null," ",null,null,0]
[null,null,null,null," ",null,null,0]
[null,null,null,null," ",null,null,0]
[null,null,null,null," ",null,null,0]
[null,null,null,null," ",null,null,0]
[null,null,null,null," ",null,null,0]
[null,null,null,null," ",null,null,0]
[null,null,null,null," ",null,null,0]
[null,null,null,null," ",null,null,0]
[null,null,null,null," ",null,null,0]
[null,null,null,null," ",null,null,0]
[null,null,null,null," ",null,null,0]
[null,null,null,null," ",null,null,0]
[null,null,null,null," ",null,null,0]
[null,null,null,null," ",null,null,0]
[null,null,null,null,{"$f":"IF(D1289>0,VLOOKUP(D1289,entidades,2,FALSE),\" \")","v":" "},null,null,{"$f":"+F1289+G1289","v":0}]
[null,null,null,null," ",null,null,0]
[null,null,null,null," ",null,null,0]
[null,null,null,null," ",null,null,0]
[null,null,null,null," ",null,null,0]
[null,null,null,null," ",null,null,0]
[null,null,null,null," ",null,null,0]
[null,null,null,null," ",null,null,0]
[null,null,null,null," ",null,null,0]
[null,null,null,null," ",null,null,0]
[null,null,null,null," ",null,null,0]
[null,null,null,null," ",null,null,0]
[null,null,null,null," ",null,null,0]
[null,null,null,null," ",null,null,0]
[null,null,null,null," ",null,null,0]
[null,null,null,null," ",null,null,0]
[null,null,null,null," ",null,null,0]
[null,null,null,null," ",null,null,0]
[null,null,null,null," ",null,null,0]
[null,null,null,null," ",null,null,0]
[null,null,null,null," ",null,null,0]
[null,null,null,null," ",null,null,0]
[null,null,null,null," ",null,null,0]
[null,null,null,null," ",null,null,0]
[null,null,null,null," ",null,null,0]
[null,null,null,null," ",null,null,0]
[null,null,null,null," ",null,null,0]
[null,null,null,null," ",null,null,0]
[null,null,null,null," ",null,null,0]
[null,null,null,null," ",null,null,0]
[null,null,null,null," ",null,null,0]
[null,null,null,null," ",null,null,0]
[null,null,null,null," ",null,null,0]
[null,null,null,null," ",null,null,0]
[null,null,null,null," ",null,null,0]
[null,null,null,null," ",null,null,0]
[null,null,null,null," ",null,null,0]
[null,null,null,null," ",null,null,0]
[null,null,null,null," ",null,null,0]
[null,null,null,null," ",null,null,0]
[null,null,null,null," ",null,null,0]
[null,null,null,null," ",null,null,0]
[null,null,null,null," ",null,null,0]
[null,null,null,null," ",null,null,0]
[null,null,null,null," ",null,null,0]
[null,null,null,null," ",null,null,0]
[null,null,null,null," ",null,null,0]
[null,null,null,null," ",null,null,0]
[null,null,null,null," ",null,null,0]
[null,null,null,null," ",null,null,0]
[null,null,null,null," ",null,null,0]
[null,null,null,null," ",null,null,0]
[null,null,null,null," ",null,null,0]
[null,null,null,null," ",null,null,0]
[null,null,null,null," ",null,null,0]
[null,null,null,null," ",null,null,0]
[null,null,null,null," ",null,null,0]
[null,null,null,null," ",null,null,0]
[null,null,null,null," ",null,null,0]
[null,null,null,null," ",null,null,0]
[null,null,null,null," ",null,null,0]
[null,null,null,null," ",null,null,0]
[null,null,null,null," ",null,null,0]
[null,null,null,null," ",null,null,0]
[null,null,null,null,{"$f":"IF(D1353>0,VLOOKUP(D1353,entidades,2,FALSE),\" \")","v":" "},null,null,{"$f":"+F1353+G1353","v":0}]
[null,null,null,null," ",null,null,0]
[null,null,null,null," ",null,null,0]
[null,null,null,null," ",null,null,0]
[null,null,null,null," ",null,null,0]
[null,null,null,null," ",null,null,0]
[null,null,null,null," ",null,null,0]
[null,null,null,null," ",null,null,0]
[null,null,null,null," ",null,null,0]
[null,null,null,null," ",null,null,0]
[null,null,null,null," ",null,null,0]
[null,null,null,null," ",null,null,0]
[null,null,null,null," ",null,null,0]
[null,null,null,null," ",null,null,0]
[null,null,null,null," ",null,null,0]
[null,null,null,null," ",null,null,0]
[null,null,null,null," ",null,null,0]
[null,null,null,null," ",null,null,0]
[null,null,null,null," ",null,null,0]
[null,null,null,null," ",null,null,0]
[null,null,null,null," ",null,null,0]
[null,null,null,null," ",null,null,0]
[null,null,null,null," ",null,null,0]
[null,null,null,null," ",null,null,0]
[null,null,null,null," ",null,null,0]
[null,null,null,null," ",null,null,0]
[null,null,null,null," ",null,null,0]
[null,null,null,null," ",null,null,0]
[null,null,null,null," ",null,null,0]
[null,null,null,null," ",null,null,0]
[null,null,null,null," ",null,null,0]
[null,null,null,null," ",null,null,0]
[null,null,null,null," ",null,null,0]
[null,null,null,null," ",null,null,0]
[null,null,null,null," ",null,null,0]
[null,null,null,null," ",null,null,0]
[null,null,null,null," ",null,null,0]
[null,null,null,null," ",null,null,0]
[null,null,null,null," ",null,null,0]
[null,null,null,null," ",null,null,0]
[null,null,null,null," ",null,null,0]
[null,null,null,null," ",null,null,0]
[null,null,null,null," ",null,null,0]
[null,null,null,null," ",null,null,0]
[null,null,null,null," ",null,null,0]
[null,null,null,null," ",null,null,0]
[null,null,null,null," ",null,null,0]
[null,null,null,null," ",null,null,0]
[null,null,null,null," ",null,null,0]
[null,null,null,null," ",null,null,0]
[null,null,null,null," ",null,null,0]
[null,null,null,null," ",null,null,0]
[null,null,null,null," ",null,null,0]
[null,null,null,null," ",null,null,0]
[null,null,null,null," ",null,null,0]
[null,null,null,null," ",null,null,0]
[null,null,null,null," ",null,null,0]
[null,null,null,null," ",null,null,0]
[null,null,null,null," ",null,null,0]
[null,null,null,null," ",null,null,0]
[null,null,null,null," ",null,null,0]
[null,null,null,null," ",null,null,0]
[null,null,null,null," ",null,null,0]
[null,null,null,null," ",null,null,0]
[null,null,null,null,{"$f":"IF(D1417>0,VLOOKUP(D1417,entidades,2,FALSE),\" \")","v":" "},null,null,{"$f":"+F1417+G1417","v":0}]
[null,null,null,null," ",null,null,0]
[null,null,null,null," ",null,null,0]
[null,null,null,null," ",null,null,0]
[null,null,null,null," ",null,null,0]
[null,null,null,null," ",null,null,0]
[null,null,null,null," ",null,null,0]
[null,null,null,null," ",null,null,0]
[null,null,null,null," ",null,null,0]
[null,null,null,null," ",null,null,0]
[null,null,null,null," ",null,null,0]
[null,null,null,null," ",null,null,0]
[null,null,null,null," ",null,null,0]
[null,null,null,null," ",null,null,0]
[null,null,null,null," ",null,null,0]
[null,null,null,null," ",null,null,0]
[null,null,null,null," ",null,null,0]
[null,null,null,null," ",null,null,0]
[null,null,null,null," ",null,null,0]
[null,null,null,null," ",null,null,0]
[null,null,null,null," ",null,null,0]
[null,null,null,null," ",null,null,0]
[null,null,null,null," ",null,null,0]
[null,null,null,null," ",null,null,0]
[null,null,null,null," ",null,null,0]
[null,null,null,null," ",null,null,0]
[null,null,null,null," ",null,null,0]
[null,null,null,null," ",null,null,0]
[null,null,null,null," ",null,null,0]
[null,null,null,null," ",null,null,0]
[null,null,null,null," ",null,null,0]
[null,null,null,null," ",null,null,0]
[null,null,null,null," ",null,null,0]
[null,null,null,null," ",null,null,0]
[null,null,null,null," ",null,null,0]
[null,null,null,null," ",null,null,0]
[null,null,null,null," ",null,null,0]
[null,null,null,null," ",null,null,0]
[null,null,null,null," ",null,null,0]
[null,null,null,null," ",null,null,0]
[null,null,null,null," ",null,null,0]
[null,null,null,null," ",null,null,0]
[null,null,null,null," ",null,null,0]
[null,null,null,null," ",null,null,0]
[null,null,null,null," ",null,null,0]
[null,null,null,null," ",null,null,0]
[null,null,null,null," ",null,null,0]
[null,null,null,null," ",null,null,0]
[null,null,null,null," ",null,null,0]
[null,null,null,null," ",null,null,0]
[null,null,null,null," ",null,null,0]
[null,null,null,null," ",null,null,0]
[null,null,null,null," ",null,null,0]
[null,null,null,null," ",null,null,0]
[null,null,null,null," ",null,null,0]
[null,null,null,null," ",null,null,0]
[null,null,null,null," ",null,null,0]
[null,null,null,null," ",null,null,0]
[null,null,null,null," ",null,null,0]
[null,null,null,null," ",null,null,0]
[null,null,null,null," ",null,null,0]
[null,null,null,null," ",null,null,0]
[null,null,null,null," ",null,null,0]
[null,null,null,null," ",null,null,0]
[null,null,null,null,{"$f":"IF(D1481>0,VLOOKUP(D1481,entidades,2,FALSE),\" \")","v":" "},null,null,{"$f":"+F1481+G1481","v":0}]
[null,null,null,null," ",null,null,0]
[null,null,null,null," ",null,null,0]
[null,null,null,null," ",null,null,0]
[null,null,null,null," ",null,null,0]
[null,null,null,null," ",null,null,0]
[null,null,null,null," ",null,null,0]
[null,null,null,null," ",null,null,0]
[null,null,null,null," ",null,null,0]
[null,null,null,null," ",null,null,0]
[null,null,null,null," ",null,null,0]
[null,null,null,null," ",null,null,0]
[null,null,null,null," ",null,null,0]
[null,null,null,null," ",null,null,0]
[null,null,null,null," ",null,null,0]
[null,null,null,null," ",null,null,0]
[null,null,null,null," ",null,null,0]
[null,null,null,null," ",null,null,0]
[null,null,null,null," ",null,null,0]
[null,null,null,null," ",null,null,0]
[null,null,null,null," ",null,null,0]
[null,null,null,null," ",null,null,0]
[null,null,null,null," ",null,null,0]
[null,null,null,null," ",null,null,0]
[null,null,null,null," ",null,null,0]
[null,null,null,null," ",null,null,0]
[null,null,null,null," ",null,null,0]
[null,null,null,null," ",null,null,0]
[null,null,null,null," ",null,null,0]
[null,null,null,null," ",null,null,0]
[null,null,null,null," ",null,null,0]
[null,null,null,null," ",null,null,0]
[null,null,null,null," ",null,null,0]
[null,null,null,null," ",null,null,0]
[null,null,null,null," ",null,null,0]
[null,null,null,null," ",null,null,0]
[null,null,null,null," ",null,null,0]
[null,null,null,null," ",null,null,0]
[null,null,null,null," ",null,null,0]
[null,null,null,null," ",null,null,0]
[null,null,null,null," ",null,null,0]
[null,null,null,null," ",null,null,0]
[null,null,null,null," ",null,null,0]
[null,null,null,null," ",null,null,0]
[null,null,null,null," ",null,null,0]
[null,null,null,null," ",null,null,0]
[null,null,null,null," ",null,null,0]
[null,null,null,null," ",null,null,0]
[null,null,null,null," ",null,null,0]
[null,null,null,null," ",null,null,0]
[null,null,null,null," ",null,null,0]
[null,null,null,null," ",null,null,0]
[null,null,null,null," ",null,null,0]
[null,null,null,null," ",null,null,0]
[null,null,null,null," ",null,null,0]
[null,null,null,null," ",null,null,0]
[null,null,null,null," ",null,null,0]
[null,null,null,null," ",null,null,0]
[null,null,null,null," ",null,null,0]
[null,null,null,null," ",null,null,0]
[null,null,null,null," ",null,null,0]
[null,null,null,null," ",null,null,0]
[null,null,null,null," ",null,null,0]
[null,null,null,null," ",null,null,0]
[null,null,null,null,{"$f":"IF(D1545>0,VLOOKUP(D1545,entidades,2,FALSE),\" \")","v":" "},null,null,{"$f":"+F1545+G1545","v":0}]
[null,null,null,null," ",null,null,0]
[null,null,null,null," ",null,null,0]
[null,null,null,null," ",null,null,0]
[null,null,null,null," ",null,null,0]
[null,null,null,null," ",null,null,0]
[null,null,null,null," ",null,null,0]
[null,null,null,null," ",null,null,0]
[null,null,null,null," ",null,null,0]
[null,null,null,null," ",null,null,0]
[null,null,null,null," ",null,null,0]
[null,null,null,null," ",null,null,0]
[null,null,null,null," ",null,null,0]
[null,null,null,null," ",null,null,0]
[null,null,null,null," ",null,null,0]
[null,null,null,null," ",null,null,0]
[null,null,null,null," ",null,null,0]
[null,null,null,null," ",null,null,0]
[null,null,null,null," ",null,null,0]
[null,null,null,null," ",null,null,0]
[null,null,null,null," ",null,null,0]
[null,null,null,null," ",null,null,0]
[null,null,null,null," ",null,null,0]
[null,null,null,null," ",null,null,0]
[null,null,null,null," ",null,null,0]
[null,null,null,null," ",null,null,0]
[null,null,null,null," ",null,null,0]
[null,null,null,null," ",null,null,0]
[null,null,null,null," ",null,null,0]
[null,null,null,null," ",null,null,0]
[null,null,null,null," ",null,null,0]
[null,null,null,null," ",null,null,0]
[null,null,null,null," ",null,null,0]
[null,null,null,null," ",null,null,0]
[null,null,null,null," ",null,null,0]
[null,null,null,null," ",null,null,0]
[null,null,null,null," ",null,null,0]
[null,null,null,null," ",null,null,0]
[null,null,null,null," ",null,null,0]
[null,null,null,null," ",null,null,0]
[null,null,null,null," ",null,null,0]
[null,null,null,null," ",null,null,0]
[null,null,null,null," ",null,null,0]
[null,null,null,null," ",null,null,0]
[null,null,null,null," ",null,null,0]
[null,null,null,null," ",null,null,0]
[null,null,null,null," ",null,null,0]
[null,null,null,null," ",null,null,0]
[null,null,null,null," ",null,null,0]
[null,null,null,null," ",null,null,0]
[null,null,null,null," ",null,null,0]
[null,null,null,null," ",null,null,0]
[null,null,null,null," ",null,null,0]
[null,null,null,null," ",null,null,0]
[null,null,null,null," ",null,null,0]
[null,null,null,null," ",null,null,0]
[null,null,null,null," ",null,null,0]
[null,null,null,null," ",null,null,0]
[null,null,null,null," ",null,null,0]
[null,null,null,null," ",null,null,0]
[null,null,null,null," ",null,null,0]
[null,null,null,null," ",null,null,0]
[null,null,null,null," ",null,null,0]
[null,null,null,null," ",null,null,0]
[null,null,null,null,{"$f":"IF(D1609>0,VLOOKUP(D1609,entidades,2,FALSE),\" \")","v":" "},null,null,{"$f":"+F1609+G1609","v":0}]
[null,null,null,null," ",null,null,0]
[null,null,null,null," ",null,null,0]
[null,null,null,null," ",null,null,0]
[null,null,null,null," ",null,null,0]
[null,null,null,null," ",null,null,0]
[null,null,null,null," ",null,null,0]
[null,null,null,null," ",null,null,0]
[null,null,null,null," ",null,null,0]
[null,null,null,null," ",null,null,0]
[null,null,null,null," ",null,null,0]
[null,null,null,null," ",null,null,0]
[null,null,null,null," ",null,null,0]
[null,null,null,null," ",null,null,0]
[null,null,null,null," ",null,null,0]
[null,null,null,null," ",null,null,0]
[null,null,null,null," ",null,null,0]
[null,null,null,null," ",null,null,0]
[null,null,null,null," ",null,null,0]
[null,null,null,null," ",null,null,0]
[null,null,null,null," ",null,null,0]
[null,null,null,null," ",null,null,0]
[null,null,null,null," ",null,null,0]
[null,null,null,null," ",null,null,0]
[null,null,null,null," ",null,null,0]
[null,null,null,null," ",null,null,0]
[null,null,null,null," ",null,null,0]
[null,null,null,null," ",null,null,0]
[null,null,null,null," ",null,null,0]
[null,null,null,null," ",null,null,0]
[null,null,null,null," ",null,null,0]
[null,null,null,null," ",null,null,0]
[null,null,null,null," ",null,null,0]
[null,null,null,null," ",null,null,0]
[null,null,null,null," ",null,null,0]
[null,null,null,null," ",null,null,0]
[null,null,null,null," ",null,null,0]
[null,null,null,null," ",null,null,0]
[null,null,null,null," ",null,null,0]
[null,null,null,null," ",null,null,0]
[null,null,null,null," ",null,null,0]
[null,null,null,null," ",null,null,0]
[null,null,null,null," ",null,null,0]
[null,null,null,null," ",null,null,0]
[null,null,null,null," ",null,null,0]
[null,null,null,null," ",null,null,0]
[null,null,null,null," ",null,null,0]
[null,null,null,null," ",null,null,0]
[null,null,null,null," ",null,null,0]
[null,null,null,null," ",null,null,0]
[null,null,null,null," ",null,null,0]
[null,null,null,null," ",null,null,0]
[null,null,null,null," ",null,null,0]
[null,null,null,null," ",null,null,0]
[null,null,null,null," ",null,null,0]
[null,null,null,null," ",null,null,0]
[null,null,null,null," ",null,null,0]
[null,null,null,null," ",null,null,0]
[null,null,null,null," ",null,null,0]
[null,null,null,null," ",null,null,0]
[null,null,null,null," ",null,null,0]
[null,null,null,null," ",null,null,0]
[null,null,null,null," ",null,null,0]
[null,null,null,null," ",null,null,0]
[null,null,null,null,{"$f":"IF(D1673>0,VLOOKUP(D1673,entidades,2,FALSE),\" \")","v":" "},null,null,{"$f":"+F1673+G1673","v":0}]
[null,null,null,null," ",null,null,0]
[null,null,null,null," ",null,null,0]
[null,null,null,null," ",null,null,0]
[null,null,null,null," ",null,null,0]
[null,null,null,null," ",null,null,0]
[null,null,null,null," ",null,null,0]
[null,null,null,null," ",null,null,0]
[null,null,null,null," ",null,null,0]
[null,null,null,null," ",null,null,0]
[null,null,null,null," ",null,null,0]
[null,null,null,null," ",null,null,0]
[null,null,null,null," ",null,null,0]
[null,null,null,null," ",null,null,0]
[null,null,null,null," ",null,null,0]
[null,null,null,null," ",null,null,0]
[null,null,null,null," ",null,null,0]
[null,null,null,null," ",null,null,0]
[null,null,null,null," ",null,null,0]
[null,null,null,null," ",null,null,0]
[null,null,null,null," ",null,null,0]
[null,null,null,null," ",null,null,0]
[null,null,null,null," ",null,null,0]
[null,null,null,null," ",null,null,0]
[null,null,null,null," ",null,null,0]
[null,null,null,null," ",null,null,0]
[null,null,null,null," ",null,null,0]
[null,null,null,null," ",null,null,0]
[null,null,null,null," ",null,null,0]
[null,null,null,null," ",null,null,0]
[null,null,null,null," ",null,null,0]
[null,null,null,null," ",null,null,0]
[null,null,null,null," ",null,null,0]
[null,null,null,null," ",null,null,0]
[null,null,null,null," ",null,null,0]
[null,null,null,null," ",null,null,0]
[null,null,null,null," ",null,null,0]
[null,null,null,null," ",null,null,0]
[null,null,null,null," ",null,null,0]
[null,null,null,null," ",null,null,0]
[null,null,null,null," ",null,null,0]
[null,null,null,null," ",null,null,0]
[null,null,null,null," ",null,null,0]
[null,null,null,null," ",null,null,0]
[null,null,null,null," ",null,null,0]
[null,null,null,null," ",null,null,0]
[null,null,null,null," ",null,null,0]
[null,null,null,null," ",null,null,0]
[null,null,null,null," ",null,null,0]
[null,null,null,null," ",null,null,0]
[null,null,null,null," ",null,null,0]
[null,null,null,null," ",null,null,0]
[null,null,null,null," ",null,null,0]
[null,null,null,null," ",null,null,0]
[null,null,null,null," ",null,null,0]
[null,null,null,null," ",null,null,0]
[null,null,null,null," ",null,null,0]
[null,null,null,null," ",null,null,0]
[null,null,null,null," ",null,null,0]
[null,null,null,null," ",null,null,0]
[null,null,null,null," ",null,null,0]
[null,null,null,null," ",null,null,0]
[null,null,null,null," ",null,null,0]
[null,null,null,null," ",null,null,0]
[null,null,null,null,{"$f":"IF(D1737>0,VLOOKUP(D1737,entidades,2,FALSE),\" \")","v":" "},null,null,{"$f":"+F1737+G1737","v":0}]
[null,null,null,null," ",null,null,0]
[null,null,null,null," ",null,null,0]
[null,null,null,null," ",null,null,0]
[null,null,null,null," ",null,null,0]
[null,null,null,null," ",null,null,0]
[null,null,null,null," ",null,null,0]
[null,null,null,null," ",null,null,0]
[null,null,null,null," ",null,null,0]
[null,null,null,null," ",null,null,0]
[null,null,null,null," ",null,null,0]
[null,null,null,null," ",null,null,0]
[null,null,null,null," ",null,null,0]
[null,null,null,null," ",null,null,0]
[null,null,null,null," ",null,null,0]
[null,null,null,null," ",null,null,0]
[null,null,null,null," ",null,null,0]
[null,null,null,null," ",null,null,0]
[null,null,null,null," ",null,null,0]
[null,null,null,null," ",null,null,0]
[null,null,null,null," ",null,null,0]
[null,null,null,null," ",null,null,0]
[null,null,null,null," ",null,null,0]
[null,null,null,null," ",null,null,0]
[null,null,null,null," ",null,null,0]
[null,null,null,null," ",null,null,0]
[null,null,null,null," ",null,null,0]
[null,null,null,null," ",null,null,0]
[null,null,null,null," ",null,null,0]
[null,null,null,null," ",null,null,0]
[null,null,null,null," ",null,null,0]
[null,null,null,null," ",null,null,0]
[null,null,null,null," ",null,null,0]
[null,null,null,null," ",null,null,0]
[null,null,null,null," ",null,null,0]
[null,null,null,null," ",null,null,0]
[null,null,null,null," ",null,null,0]
[null,null,null,null," ",null,null,0]
[null,null,null,null," ",null,null,0]
[null,null,null,null," ",null,null,0]
[null,null,null,null," ",null,null,0]
[null,null,null,null," ",null,null,0]
[null,null,null,null," ",null,null,0]
[null,null,null,null," ",null,null,0]
[null,null,null,null," ",null,null,0]
[null,null,null,null," ",null,null,0]
[null,null,null,null," ",null,null,0]
[null,null,null,null," ",null,null,0]
[null,null,null,null," ",null,null,0]
[null,null,null,null," ",null,null,0]
[null,null,null,null," ",null,null,0]
[null,null,null,null," ",null,null,0]
[null,null,null,null," ",null,null,0]
[null,null,null,null," ",null,null,0]
[null,null,null,null," ",null,null,0]
[null,null,null,null," ",null,null,0]
[null,null,null,null," ",null,null,0]
[null,null,null,null," ",null,null,0]
[null,null,null,null," ",null,null,0]
[null,null,null,null," ",null,null,0]
[null,null,null,null," ",null,null,0]
[null,null,null,null," ",null,null,0]
[null,null,null,null," ",null,null,0]
[null,null,null,null," ",null,null,0]
[null,null,null,null,{"$f":"IF(D1801>0,VLOOKUP(D1801,entidades,2,FALSE),\" \")","v":" "},null,null,{"$f":"+F1801+G1801","v":0}]
[null,null,null,null," ",null,null,0]
[null,null,null,null," ",null,null,0]
[null,null,null,null," ",null,null,0]
[null,null,null,null," ",null,null,0]
[null,null,null,null," ",null,null,0]
[null,null,null,null," ",null,null,0]
[null,null,null,null," ",null,null,0]
[null,null,null,null," ",null,null,0]
[null,null,null,null," ",null,null,0]
[null,null,null,null," ",null,null,0]
[null,null,null,null," ",null,null,0]
[null,null,null,null," ",null,null,0]
[null,null,null,null," ",null,null,0]
[null,null,null,null," ",null,null,0]
[null,null,null,null," ",null,null,0]
[null,null,null,null," ",null,null,0]
[null,null,null,null," ",null,null,0]
[null,null,null,null," ",null,null,0]
[null,null,null,null," ",null,null,0]
[null,null,null,null," ",null,null,0]
[null,null,null,null," ",null,null,0]
[null,null,null,null," ",null,null,0]
[null,null,null,null," ",null,null,0]
[null,null,null,null," ",null,null,0]
[null,null,null,null," ",null,null,0]
[null,null,null,null," ",null,null,0]
[null,null,null,null," ",null,null,0]
[null,null,null,null," ",null,null,0]
[null,null,null,null," ",null,null,0]
[null,null,null,null," ",null,null,0]
[null,null,null,null," ",null,null,0]
[null,null,null,null," ",null,null,0]
[null,null,null,null," ",null,null,0]
[null,null,null,null," ",null,null,0]
[null,null,null,null," ",null,null,0]
[null,null,null,null," ",null,null,0]
[null,null,null,null," ",null,null,0]
[null,null,null,null," ",null,null,0]
[null,null,null,null," ",null,null,0]
[null,null,null,null," ",null,null,0]
[null,null,null,null," ",null,null,0]
[null,null,null,null," ",null,null,0]
[null,null,null,null," ",null,null,0]
[null,null,null,null," ",null,null,0]
[null,null,null,null," ",null,null,0]
[null,null,null,null," ",null,null,0]
[null,null,null,null," ",null,null,0]
[null,null,null,null," ",null,null,0]
[null,null,null,null," ",null,null,0]
[null,null,null,null," ",null,null,0]
[null,null,null,null," ",null,null,0]
[null,null,null,null," ",null,null,0]
[null,null,null,null," ",null,null,0]
[null,null,null,null," ",null,null,0]
[null,null,null,null," ",null,null,0]
[null,null,null,null," ",null,null,0]
[null,null,null,null," ",null,null,0]
[null,null,null,null," ",null,null,0]
[null,null,null,null," ",null,null,0]
[null,null,null,null," ",null,null,0]
[null,null,null,null," ",null,null,0]
[null,null,null,null," ",null,null,0]
[null,null,null,null," ",null,null,0]
[null,null,null,null,{"$f":"IF(D1865>0,VLOOKUP(D1865,entidades,2,FALSE),\" \")","v":" "},null,null,{"$f":"+F1865+G1865","v":0}]
[null,null,null,null," ",null,null,0]
[null,null,null,null," ",null,null,0]
[null,null,null,null," ",null,null,0]
[null,null,null,null," ",null,null,0]
[null,null,null,null," ",null,null,0]
[null,null,null,null," ",null,null,0]
[null,null,null,null," ",null,null,0]
[null,null,null,null," ",null,null,0]
[null,null,null,null," ",null,null,0]
[null,null,null,null," ",null,null,0]
[null,null,null,null," ",null,null,0]
[null,null,null,null," ",null,null,0]
[null,null,null,null," ",null,null,0]
[null,null,null,null," ",null,null,0]
[null,null,null,null," ",null,null,0]
[null,null,null,null," ",null,null,0]
[null,null,null,null," ",null,null,0]
[null,null,null,null," ",null,null,0]
[null,null,null,null," ",null,null,0]
[null,null,null,null," ",null,null,0]
[null,null,null,null," ",null,null,0]
[null,null,null,null," ",null,null,0]
[null,null,null,null," ",null,null,0]
[null,null,null,null," ",null,null,0]
[null,null,null,null," ",null,null,0]
[null,null,null,null," ",null,null,0]
[null,null,null,null," ",null,null,0]
[null,null,null,null," ",null,null,0]
[null,null,null,null," ",null,null,0]
[null,null,null,null," ",null,null,0]
[null,null,null,null," ",null,null,0]
[null,null,null,null," ",null,null,0]
[null,null,null,null," ",null,null,0]
[null,null,null,null," ",null,null,0]
[null,null,null,null," ",null,null,0]
[null,null,null,null," ",null,null,0]
[null,null,null,null," ",null,null,0]
[null,null,null,null," ",null,null,0]
[null,null,null,null," ",null,null,0]
[null,null,null,null," ",null,null,0]
[null,null,null,null," ",null,null,0]
[null,null,null,null," ",null,null,0]
[null,null,null,null," ",null,null,0]
[null,null,null,null," ",null,null,0]
[null,null,null,null," ",null,null,0]
[null,null,null,null," ",null,null,0]
[null,null,null,null," ",null,null,0]
[null,null,null,null," ",null,null,0]
[null,null,null,null," ",null,null,0]
[null,null,null,null," ",null,null,0]
[null,null,null,null," ",null,null,0]
[null,null,null,null," ",null,null,0]
[null,null,null,null," ",null,null,0]
[null,null,null,null," ",null,null,0]
[null,null,null,null," ",null,null,0]
[null,null,null,null," ",null,null,0]
[null,null,null,null," ",null,null,0]
[null,null,null,null," ",null,null,0]
[null,null,null,null," ",null,null,0]
[null,null,null,null," ",null,null,0]
[null,null,null,null," ",null,null,0]
[null,null,null,null," ",null,null,0]
[null,null,null,null," ",null,null,0]
[null,null,null,null,{"$f":"IF(D1929>0,VLOOKUP(D1929,entidades,2,FALSE),\" \")","v":" "},null,null,{"$f":"+F1929+G1929","v":0}]
[null,null,null,null," ",null,null,0]
[null,null,null,null," ",null,null,0]
[null,null,null,null," ",null,null,0]
[null,null,null,null," ",null,null,0]
[null,null,null,null," ",null,null,0]
[null,null,null,null," ",null,null,0]
[null,null,null,null," ",null,null,0]
[null,null,null,null," ",null,null,0]
[null,null,null,null," ",null,null,0]
[null,null,null,null," ",null,null,0]
[null,null,null,null," ",null,null,0]
[null,null,null,null," ",null,null,0]
[null,null,null,null," ",null,null,0]
[null,null,null,null," ",null,null,0]
[null,null,null,null," ",null,null,0]
[null,null,null,null," ",null,null,0]
[null,null,null,null," ",null,null,0]
[null,null,null,null," ",null,null,0]
[null,null,null,null," ",null,null,0]
[null,null,null,null," ",null,null,0]
[null,null,null,null," ",null,null,0]
[null,null,null,null," ",null,null,0]
[null,null,null,null," ",null,null,0]
[null,null,null,null," ",null,null,0]
[null,null,null,null," ",null,null,0]
[null,null,null,null," ",null,null,0]
[null,null,null,null," ",null,null,0]
[null,null,null,null," ",null,null,0]
[null,null,null,null," ",null,null,0]
[null,null,null,null," ",null,null,0]
[null,null,null,null," ",null,null,0]
[null,null,null,null," ",null,null,0]
[null,null,null,null," ",null,null,0]
[null,null,null,null," ",null,null,0]
[null,null,null,null," ",null,null,0]
[null,null,null,null," ",null,null,0]
[null,null,null,null," ",null,null,0]
[null,null,null,null," ",null,null,0]
[null,null,null,null," ",null,null,0]
[null,null,null,null," ",null,null,0]
[null,null,null,null," ",null,null,0]
[null,null,null,null," ",null,null,0]
[null,null,null,null," ",null,null,0]
[null,null,null,null," ",null,null,0]
[null,null,null,null," ",null,null,0]
[null,null,null,null," ",null,null,0]
[null,null,null,null," ",null,null,0]
[null,null,null,null," ",null,null,0]
[null,null,null,null," ",null,null,0]
[null,null,null,null," ",null,null,0]
[null,null,null,null," ",null,null,0]
[null,null,null,null," ",null,null,0]
[null,null,null,null," ",null,null,0]
[null,null,null,null," ",null,null,0]
[null,null,null,null," ",null,null,0]
[null,null,null,null," ",null,null,0]
[null,null,null,null," ",null,null,0]
[null,null,null,null," ",null,null,0]
[null,null,null,null," ",null,null,0]
[null,null,null,null," ",null,null,0]
[null,null,null,null," ",null,null,0]
[null,null,null,null," ",null,null,0]
[null,null,null,null," ",null,null,0]
[null,null,null,null,{"$f":"IF(D1993>0,VLOOKUP(D1993,entidades,2,FALSE),\" \")","v":" "},null,null,{"$f":"+F1993+G1993","v":0}]
[null,null,null,null," ",null,null,0]
[null,null,null,null," ",null,null,0]
[null,null,null,null," ",null,null,0]
[null,null,null,null," ",null,null,0]
[null,null,null,null," ",null,null,0]
[null,null,null,null," ",null,null,0]
[null,null,null,null," ",null,null,0]
[null,null,null,null," ",null,null,0]
[null,null,null,null," ",null,null,0]
[null,null,null,null," ",null,null,0]
[null,null,null,null," ",null,null,0]
[null,null,null,null," ",null,null,0]
[null,null,null,null," ",null,null,0]
[null,null,null,null," ",null,null,0]
[null,null,null,null," ",null,null,0]
[null,null,null,null," ",null,null,0]
[null,null,null,null," ",null,null,0]
[null,null,null,null," ",null,null,0]
[null,null,null,null," ",null,null,0]
[null,null,null,null," ",null,null,0]
[null,null,null,null," ",null,null,0]
[null,null,null,null," ",null,null,0]
[null,null,null,null," ",null,null,0]
[null,null,null,null," ",null,null,0]
[null,null,null,null," ",null,null,0]
[null,null,null,null," ",null,null,0]
[null,null,null,null," ",null,null,0]
[null,null,null,null," ",null,null,0]
[null,null,null,null," ",null,null,0]
[null,null,null,null," ",null,null,0]
[null,null,null,null," ",null,null,0]
[null,null,null,null," ",null,null,0]
[null,null,null,null," ",null,null,0]
[null,null,null,null," ",null,null,0]
[null,null,null,null," ",null,null,0]
[null,null,null,null," ",null,null,0]
[null,null,null,null," ",null,null,0]
[null,null,null,null," ",null,null,0]
[null,null,null,null," ",null,null,0]
[null,null,null,null," ",null,null,0]
[null,null,null,null," ",null,null,0]
[null,null,null,null," ",null,null,0]
[null,null,null,null," ",null,null,0]
[null,null,null,null," ",null,null,0]
[null,null,null,null," ",null,null,0]
[null,null,null,null," ",null,null,0]
[null,null,null,null," ",null,null,0]
[null,null,null,null," ",null,null,0]
[null,null,null,null," ",null,null,0]
[null,null,null,null," ",null,null,0]
[null,null,null,null," ",null,null,0]
[null,null,null,null," ",null,null,0]
[null,null,null,null," ",null,null,0]
[null,null,null,null," ",null,null,0]
[null,null,null,null," ",null,null,0]
[null,null,null,null," ",null,null,0]
[null,null,null,null," ",null,null,0]
[null,null,null,null," ",null,null,0]
[null,null,null,null," ",null,null,0]
[null,null,null,null," ",null,null,0]
[null,null,null,null," ",null,null,0]
[null,null,null,null," ",null,null,0]
[null,null,null,null," ",null,null,0]
[null,null,null,null,{"$f":"IF(D2057>0,VLOOKUP(D2057,entidades,2,FALSE),\" \")","v":" "},null,null,{"$f":"+F2057+G2057","v":0}]
[null,null,null,null," ",null,null,0]
[null,null,null,null," ",null,null,0]
[null,null,null,null," ",null,null,0]
[null,null,null,null," ",null,null,0]
[null,null,null,null," ",null,null,0]
[null,null,null,null," ",null,null,0]
[null,null,null,null," ",null,null,0]
[null,null,null,null," ",null,null,0]
[null,null,null,null," ",null,null,0]
[null,null,null,null," ",null,null,0]
[null,null,null,null," ",null,null,0]
[null,null,null,null," ",null,null,0]
[null,null,null,null," ",null,null,0]
[null,null,null,null," ",null,null,0]
[null,null,null,null," ",null,null,0]
[null,null,null,null," ",null,null,0]
[null,null,null,null," ",null,null,0]
[null,null,null,null," ",null,null,0]
[null,null,null,null," ",null,null,0]
[null,null,null,null," ",null,null,0]
[null,null,null,null," ",null,null,0]
[null,null,null,null," ",null,null,0]
[null,null,null,null," ",null,null,0]
[null,null,null,null," ",null,null,0]
[null,null,null,null," ",null,null,0]
[null,null,null,null," ",null,null,0]
[null,null,null,null," ",null,null,0]
[null,null,null,null," ",null,null,0]
[null,null,null,null," ",null,null,0]
[null,null,null,null," ",null,null,0]
[null,null,null,null," ",null,null,0]
[null,null,null,null," ",null,null,0]
[null,null,null,null," ",null,null,0]
[null,null,null,null," ",null,null,0]
[null,null,null,null," ",null,null,0]
[null,null,null,null," ",null,null,0]
[null,null,null,null," ",null,null,0]
[null,null,null,null," ",null,null,0]
[null,null,null,null," ",null,null,0]
[null,null,null,null," ",null,null,0]
[null,null,null,null," ",null,null,0]
[null,null,null,null," ",null,null,0]
[null,null,null,null," ",null,null,0]
[null,null,null,null," ",null,null,0]
[null,null,null,null," ",null,null,0]
[null,null,null,null," ",null,null,0]
[null,null,null,null," ",null,null,0]
[null,null,null,null," ",null,null,0]
[null,null,null,null," ",null,null,0]
[null,null,null,null," ",null,null,0]
[null,null,null,null," ",null,null,0]
[null,null,null,null," ",null,null,0]
[null,null,null,null," ",null,null,0]
[null,null,null,null," ",null,null,0]
[null,null,null,null," ",null,null,0]
[null,null,null,null," ",null,null,0]
[null,null,null,null," ",null,null,0]
[null,null,null,null," ",null,null,0]
[null,null,null,null," ",null,null,0]
[null,null,null,null," ",null,null,0]
[null,null,null,null," ",null,null,0]
[null,null,null,null," ",null,null,0]
[null,null,null,null," ",null,null,0]
[null,null,null,null,{"$f":"IF(D2121>0,VLOOKUP(D2121,entidades,2,FALSE),\" \")","v":" "},null,null,{"$f":"+F2121+G2121","v":0}]
[null,null,null,null," ",null,null,0]
[null,null,null,null," ",null,null,0]
[null,null,null,null," ",null,null,0]
[null,null,null,null," ",null,null,0]
[null,null,null,null," ",null,null,0]
[null,null,null,null," ",null,null,0]
[null,null,null,null," ",null,null,0]
[null,null,null,null," ",null,null,0]
[null,null,null,null," ",null,null,0]
[null,null,null,null," ",null,null,0]
[null,null,null,null," ",null,null,0]
[null,null,null,null," ",null,null,0]
[null,null,null,null," ",null,null,0]
[null,null,null,null," ",null,null,0]
[null,null,null,null," ",null,null,0]
[null,null,null,null," ",null,null,0]
[null,null,null,null," ",null,null,0]
[null,null,null,null," ",null,null,0]
[null,null,null,null," ",null,null,0]
[null,null,null,null," ",null,null,0]
[null,null,null,null," ",null,null,0]
[null,null,null,null," ",null,null,0]
[null,null,null,null," ",null,null,0]
[null,null,null,null," ",null,null,0]
[null,null,null,null," ",null,null,0]
[null,null,null,null," ",null,null,0]
[null,null,null,null," ",null,null,0]
[null,null,null,null," ",null,null,0]
[null,null,null,null," ",null,null,0]
[null,null,null,null," ",null,null,0]
[null,null,null,null," ",null,null,0]
[null,null,null,null," ",null,null,0]
[null,null,null,null," ",null,null,0]
[null,null,null,null," ",null,null,0]
[null,null,null,null," ",null,null,0]
[null,null,null,null," ",null,null,0]
[null,null,null,null," ",null,null,0]
[null,null,null,null," ",null,null,0]
[null,null,null,null," ",null,null,0]
[null,null,null,null," ",null,null,0]
[null,null,null,null," ",null,null,0]
[null,null,null,null," ",null,null,0]
[null,null,null,null," ",null,null,0]
[null,null,null,null," ",null,null,0]
[null,null,null,null," ",null,null,0]
[null,null,null,null," ",null,null,0]
[null,null,null,null," ",null,null,0]
[null,null,null,null," ",null,null,0]
[null,null,null,null," ",null,null,0]
[null,null,null,null," ",null,null,0]
[null,null,null,null," ",null,null,0]
[null,null,null,null," ",null,null,0]
[null,null,null,null," ",null,null,0]
[null,null,null,null," ",null,null,0]
[null,null,null,null," ",null,null,0]
[null,null,null,null," ",null,null,0]
[null,null,null,null," ",null,null,0]
[null,null,null,null," ",null,null,0]
[null,null,null,null," ",null,null,0]
[null,null,null,null," ",null,null,0]
[null,null,null,null," ",null,null,0]
[null,null,null,null," ",null,null,0]
[null,null,null,null," ",null,null,0]
[null,null,null,null,{"$f":"IF(D2185>0,VLOOKUP(D2185,entidades,2,FALSE),\" \")","v":" "},null,null,{"$f":"+F2185+G2185","v":0}]
[null,null,null,null," ",null,null,0]
[null,null,null,null," ",null,null,0]
[null,null,null,null," ",null,null,0]
[null,null,null,null," ",null,null,0]
[null,null,null,null," ",null,null,0]
[null,null,null,null," ",null,null,0]
[null,null,null,null," ",null,null,0]
[null,null,null,null," ",null,null,0]
[null,null,null,null," ",null,null,0]
[null,null,null,null," ",null,null,0]
[null,null,null,null," ",null,null,0]
[null,null,null,null," ",null,null,0]
[null,null,null,null," ",null,null,0]
[null,null,null,null," ",null,null,0]
[null,null,null,null," ",null,null,0]
[null,null,null,null," ",null,null,0]
[null,null,null,null," ",null,null,0]
[null,null,null,null," ",null,null,0]
[null,null,null,null," ",null,null,0]
[null,null,null,null," ",null,null,0]
[null,null,null,null," ",null,null,0]
[null,null,null,null," ",null,null,0]
[null,null,null,null," ",null,null,0]
[null,null,null,null," ",null,null,0]
[null,null,null,null," ",null,null,0]
[null,null,null,null," ",null,null,0]
[null,null,null,null," ",null,null,0]
[null,null,null,null," ",null,null,0]
[null,null,null,null," ",null,null,0]
[null,null,null,null," ",null,null,0]
[null,null,null,null," ",null,null,0]
[null,null,null,null," ",null,null,0]
[null,null,null,null," ",null,null,0]
[null,null,null,null," ",null,null,0]
[null,null,null,null," ",null,null,0]
[null,null,null,null," ",null,null,0]
[null,null,null,null," ",null,null,0]
[null,null,null,null," ",null,null,0]
[null,null,null,null," ",null,null,0]
[null,null,null,null," ",null,null,0]
[null,null,null,null," ",null,null,0]
[null,null,null,null," ",null,null,0]
[null,null,null,null," ",null,null,0]
[null,null,null,null," ",null,null,0]
[null,null,null,null," ",null,null,0]
[null,null,null,null," ",null,null,0]
[null,null,null,null," ",null,null,0]
[null,null,null,null," ",null,null,0]
[null,null,null,null," ",null,null,0]
[null,null,null,null," ",null,null,0]
[null,null,null,null," ",null,null,0]
[null,null,null,null," ",null,null,0]
[null,null,null,null," ",null,null,0]
[null,null,null,null," ",null,null,0]
[null,null,null,null," ",null,null,0]
[null,null,null,null," ",null,null,0]
[null,null,null,null," ",null,null,0]
[null,null,null,null," ",null,null,0]
[null,null,null,null," ",null,null,0]
[null,null,null,null," ",null,null,0]
[null,null,null,null," ",null,null,0]
[null,null,null,null," ",null,null,0]
[null,null,null,null," ",null,null,0]
[null,null,null,null,{"$f":"IF(D2249>0,VLOOKUP(D2249,entidades,2,FALSE),\" \")","v":" "},null,null,{"$f":"+F2249+G2249","v":0}]
[null,null,null,null," ",null,null,0]
[null,null,null,null," ",null,null,0]
[null,null,null,null," ",null,null,0]
[null,null,null,null," ",null,null,0]
[null,null,null,null," ",null,null,0]
[null,null,null,null," ",null,null,0]
[null,null,null,null," ",null,null,0]
[null,null,null,null," ",null,null,0]
[null,null,null,null," ",null,null,0]
[null,null,null,null," ",null,null,0]
[null,null,null,null," ",null,null,0]
[null,null,null,null," ",null,null,0]
[null,null,null,null," ",null,null,0]
[null,null,null,null," ",null,null,0]
[null,null,null,null," ",null,null,0]
[null,null,null,null," ",null,null,0]
[null,null,null,null," ",null,null,0]
[null,null,null,null," ",null,null,0]
[null,null,null,null," ",null,null,0]
[null,null,null,null," ",null,null,0]
[null,null,null,null," ",null,null,0]
[null,null,null,null," ",null,null,0]
[null,null,null,null," ",null,null,0]
[null,null,null,null," ",null,null,0]
[null,null,null,null," ",null,null,0]
[null,null,null,null," ",null,null,0]
[null,null,null,null," ",null,null,0]
[null,null,null,null," ",null,null,0]
[null,null,null,null," ",null,null,0]
[null,null,null,null," ",null,null,0]
[null,null,null,null," ",null,null,0]
[null,null,null,null," ",null,null,0]
[null,null,null,null," ",null,null,0]
[null,null,null,null," ",null,null,0]
[null,null,null,null," ",null,null,0]
[null,null,null,null," ",null,null,0]
[null,null,null,null," ",null,null,0]
[null,null,null,null," ",null,null,0]
[null,null,null,null," ",null,null,0]
[null,null,null,null," ",null,null,0]
[null,null,null,null," ",null,null,0]
[null,null,null,null," ",null,null,0]
[null,null,null,null," ",null,null,0]
[null,null,null,null," ",null,null,0]
[null,null,null,null," ",null,null,0]
[null,null,null,null," ",null,null,0]
[null,null,null,null," ",null,null,0]
[null,null,null,null," ",null,null,0]
[null,null,null,null," ",null,null,0]
[null,null,null,null," ",null,null,0]
[null,null,null,null," ",null,null,0]
[null,null,null,null," ",null,null,0]
[null,null,null,null," ",null,null,0]
[null,null,null,null," ",null,null,0]
[null,null,null,null," ",null,null,0]
[null,null,null,null," ",null,null,0]
[null,null,null,null," ",null,null,0]
[null,null,null,null," ",null,null,0]
[null,null,null,null," ",null,null,0]
[null,null,null,null," ",null,null,0]
[null,null,null,null," ",null,null,0]
[null,null,null,null," ",null,null,0]
[null,null,null,null," ",null,null,0]
[null,null,null,null,{"$f":"IF(D2313>0,VLOOKUP(D2313,entidades,2,FALSE),\" \")","v":" "},null,null,{"$f":"+F2313+G2313","v":0}]
[null,null,null,null," ",null,null,0]
[null,null,null,null," ",null,null,0]
[null,null,null,null," ",null,null,0]
[null,null,null,null," ",null,null,0]
[null,null,null,null," ",null,null,0]
[null,null,null,null," ",null,null,0]
[null,null,null,null," ",null,null,0]
[null,null,null,null," ",null,null,0]
[null,null,null,null," ",null,null,0]
[null,null,null,null," ",null,null,0]
[null,null,null,null," ",null,null,0]
[null,null,null,null," ",null,null,0]
[null,null,null,null," ",null,null,0]
[null,null,null,null," ",null,null,0]
[null,null,null,null," ",null,null,0]
[null,null,null,null," ",null,null,0]
[null,null,null,null," ",null,null,0]
[null,null,null,null," ",null,null,0]
[null,null,null,null," ",null,null,0]
[null,null,null,null," ",null,null,0]
[null,null,null,null," ",null,null,0]
[null,null,null,null," ",null,null,0]
[null,null,null,null," ",null,null,0]
[null,null,null,null," ",null,null,0]
[null,null,null,null," ",null,null,0]
[null,null,null,null," ",null,null,0]
[null,null,null,null," ",null,null,0]
[null,null,null,null," ",null,null,0]
[null,null,null,null," ",null,null,0]
[null,null,null,null," ",null,null,0]
[null,null,null,null," ",null,null,0]
[null,null,null,null," ",null,null,0]
[null,null,null,null," ",null,null,0]
[null,null,null,null," ",null,null,0]
[null,null,null,null," ",null,null,0]
[null,null,null,null," ",null,null,0]
[null,null,null,null," ",null,null,0]
[null,null,null,null," ",null,null,0]
[null,null,null,null," ",null,null,0]
[null,null,null,null," ",null,null,0]
[null,null,null,null," ",null,null,0]
[null,null,null,null," ",null,null,0]
[null,null,null,null," ",null,null,0]
[null,null,null,null," ",null,null,0]
[null,null,null,null," ",null,null,0]
[null,null,null,null," ",null,null,0]
[null,null,null,null," ",null,null,0]
[null,null,null,null," ",null,null,0]
[null,null,null,null," ",null,null,0]
[null,null,null,null," ",null,null,0]
[null,null,null,null," ",null,null,0]
[null,null,null,null," ",null,null,0]
[null,null,null,null," ",null,null,0]
[null,null,null,null," ",null,null,0]
[null,null,null,null," ",null,null,0]
[null,null,null,null," ",null,null,0]
[null,null,null,null," ",null,null,0]
[null,null,null,null," ",null,null,0]
[null,null,null,null," ",null,null,0]
[null,null,null,null," ",null,null,0]
[null,null,null,null," ",null,null,0]
[null,null,null,null," ",null,null,0]
[null,null,null,null," ",null,null,0]
[null,null,null,null,{"$f":"IF(D2377>0,VLOOKUP(D2377,entidades,2,FALSE),\" \")","v":" "},null,null,{"$f":"+F2377+G2377","v":0}]
[null,null,null,null," ",null,null,0]
[null,null,null,null," ",null,null,0]
[null,null,null,null," ",null,null,0]
[null,null,null,null," ",null,null,0]
[null,null,null,null," ",null,null,0]
[null,null,null,null," ",null,null,0]
[null,null,null,null," ",null,null,0]
[null,null,null,null," ",null,null,0]
[null,null,null,null," ",null,null,0]
[null,null,null,null," ",null,null,0]
[null,null,null,null," ",null,null,0]
[null,null,null,null," ",null,null,0]
[null,null,null,null," ",null,null,0]
[null,null,null,null," ",null,null,0]
[null,null,null,null," ",null,null,0]
[null,null,null,null," ",null,null,0]
[null,null,null,null," ",null,null,0]
[null,null,null,null," ",null,null,0]
[null,null,null,null," ",null,null,0]
[null,null,null,null," ",null,null,0]
[null,null,null,null," ",null,null,0]
[null,null,null,null," ",null,null,0]
[null,null,null,null," ",null,null,0]
[null,null,null,null," ",null,null,0]
[null,null,null,null," ",null,null,0]
[null,null,null,null," ",null,null,0]
[null,null,null,null," ",null,null,0]
[null,null,null,null," ",null,null,0]
[null,null,null,null," ",null,null,0]
[null,null,null,null," ",null,null,0]
[null,null,null,null," ",null,null,0]
[null,null,null,null," ",null,null,0]
[null,null,null,null," ",null,null,0]
[null,null,null,null," ",null,null,0]
[null,null,null,null," ",null,null,0]
[null,null,null,null," ",null,null,0]
[null,null,null,null," ",null,null,0]
[null,null,null,null," ",null,null,0]
[null,null,null,null," ",null,null,0]
[null,null,null,null," ",null,null,0]
[null,null,null,null," ",null,null,0]
[null,null,null,null," ",null,null,0]
[null,null,null,null," ",null,null,0]
[null,null,null,null," ",null,null,0]
[null,null,null,null," ",null,null,0]
[null,null,null,null," ",null,null,0]
[null,null,null,null," ",null,null,0]
[null,null,null,null," ",null,null,0]
[null,null,null,null," ",null,null,0]
[null,null,null,null," ",null,null,0]
[null,null,null,null," ",null,null,0]
[null,null,null,null," ",null,null,0]
[null,null,null,null," ",null,null,0]
[null,null,null,null," ",null,null,0]
[null,null,null,null," ",null,null,0]
[null,null,null,null," ",null,null,0]
[null,null,null,null," ",null,null,0]
[null,null,null,null," ",null,null,0]
[null,null,null,null," ",null,null,0]
[null,null,null,null," ",null,null,0]
[null,null,null,null," ",null,null,0]
[null,null,null,null," ",null,null,0]
[null,null,null,null," ",null,null,0]
[null,null,null,null,{"$f":"IF(D2441>0,VLOOKUP(D2441,entidades,2,FALSE),\" \")","v":" "},null,null,{"$f":"+F2441+G2441","v":0}]
[null,null,null,null," ",null,null,0]
[null,null,null,null," ",null,null,0]
[null,null,null,null," ",null,null,0]
[null,null,null,null," ",null,null,0]
[null,null,null,null," ",null,null,0]
[null,null,null,null," ",null,null,0]
[null,null,null,null," ",null,null,0]
[null,null,null,null," ",null,null,0]
[null,null,null,null," ",null,null,0]
[null,null,null,null," ",null,null,0]
[null,null,null,null," ",null,null,0]
[null,null,null,null," ",null,null,0]
[null,null,null,null," ",null,null,0]
[null,null,null,null," ",null,null,0]
[null,null,null,null," ",null,null,0]
[null,null,null,null," ",null,null,0]
[null,null,null,null," ",null,null,0]
[null,null,null,null," ",null,null,0]
[null,null,null,null," ",null,null,0]
[null,null,null,null," ",null,null,0]
[null,null,null,null," ",null,null,0]
[null,null,null,null," ",null,null,0]
[null,null,null,null," ",null,null,0]
[null,null,null,null," ",null,null,0]
[null,null,null,null," ",null,null,0]
[null,null,null,null," ",null,null,0]
[null,null,null,null," ",null,null,0]
[null,null,null,null," ",null,null,0]
[null,null,null,null," ",null,null,0]
[null,null,null,null," ",null,null,0]
[null,null,null,null," ",null,null,0]
[null,null,null,null," ",null,null,0]
[null,null,null,null," ",null,null,0]
[null,null,null,null," ",null,null,0]
[null,null,null,null," ",null,null,0]
[null,null,null,null," ",null,null,0]
[null,null,null,null," ",null,null,0]
[null,null,null,null," ",null,null,0]
[null,null,null,null," ",null,null,0]
[null,null,null,null," ",null,null,0]
[null,null,null,null," ",null,null,0]
[null,null,null,null," ",null,null,0]
[null,null,null,null," ",null,null,0]
[null,null,null,null," ",null,null,0]
[null,null,null,null," ",null,null,0]
[null,null,null,null," ",null,null,0]
[null,null,null,null," ",null,null,0]
[null,null,null,null," ",null,null,0]
[null,null,null,null," ",null,null,0]
[null,null,null,null," ",null,null,0]
[null,null,null,null," ",null,null,0]
[null,null,null,null," ",null,null,0]
[null,null,null,null," ",null,null,0]
[null,null,null,null," ",null,null,0]
[null,null,null,null," ",null,null,0]
[null,null,null,null," ",null,null,0]
[null,null,null,null," ",null,null,0]
[null,null,null,null," ",null,null,0]
[null,null,null,null," ",null,null,0]
[null,null,null,null," ",null,null,0]
[null,null,null,null," ",null,null,0]
[null,null,null,null," ",null,null,0]
[null,null,null,null," ",null,null,0]
[null,null,null,null,{"$f":"IF(D2505>0,VLOOKUP(D2505,entidades,2,FALSE),\" \")","v":" "},null,null,{"$f":"+F2505+G2505","v":0}]
[null,null,null,null," ",null,null,0]
[null,null,null,null," ",null,null,0]
[null,null,null,null," ",null,null,0]
[null,null,null,null," ",null,null,0]
[null,null,null,null," ",null,null,0]
[null,null,null,null," ",null,null,0]
[null,null,null,null," ",null,null,0]
[null,null,null,null," ",null,null,0]
[null,null,null,null," ",null,null,0]
[null,null,null,null," ",null,null,0]
[null,null,null,null," ",null,null,0]
[null,null,null,null," ",null,null,0]
[null,null,null,null," ",null,null,0]
[null,null,null,null," ",null,null,0]
[null,null,null,null," ",null,null,0]
[null,null,null,null," ",null,null,0]
[null,null,null,null," ",null,null,0]
[null,null,null,null," ",null,null,0]
[null,null,null,null," ",null,null,0]
[null,null,null,null," ",null,null,0]
[null,null,null,null," ",null,null,0]
[null,null,null,null," ",null,null,0]
[null,null,null,null," ",null,null,0]
[null,null,null,null," ",null,null,0]
[null,null,null,null," ",null,null,0]
[null,null,null,null," ",null,null,0]
[null,null,null,null," ",null,null,0]
[null,null,null,null," ",null,null,0]
[null,null,null,null," ",null,null,0]
[null,null,null,null," ",null,null,0]
[null,null,null,null," ",null,null,0]
[null,null,null,null," ",null,null,0]
[null,null,null,null," ",null,null,0]
[null,null,null,null," ",null,null,0]
[null,null,null,null," ",null,null,0]
[null,null,null,null," ",null,null,0]
[null,null,null,null," ",null,null,0]
[null,null,null,null," ",null,null,0]
[null,null,null,null," ",null,null,0]
[null,null,null,null," ",null,null,0]
[null,null,null,null," ",null,null,0]
[null,null,null,null," ",null,null,0]
[null,null,null,null," ",null,null,0]
[null,null,null,null," ",null,null,0]
[null,null,null,null," ",null,null,0]
[null,null,null,null," ",null,null,0]
[null,null,null,null," ",null,null,0]
[null,null,null,null," ",null,null,0]
[null,null,null,null," ",null,null,0]
[null,null,null,null," ",null,null,0]
[null,null,null,null," ",null,null,0]
[null,null,null,null," ",null,null,0]
[null,null,null,null," ",null,null,0]
[null,null,null,null," ",null,null,0]
[null,null,null,null," ",null,null,0]
[null,null,null,null," ",null,null,0]
[null,null,null,null," ",null,null,0]
[null,null,null,null," ",null,null,0]
[null,null,null,null," ",null,null,0]
[null,null,null,null," ",null,null,0]
[null,null,null,null," ",null,null,0]
[null,null,null,null," ",null,null,0]
[null,null,null,null," ",null,null,0]
[null,null,null,null,{"$f":"IF(D2569>0,VLOOKUP(D2569,entidades,2,FALSE),\" \")","v":" "},null,null,{"$f":"+F2569+G2569","v":0}]
[null,null,null,null," ",null,null,0]
[null,null,null,null," ",null,null,0]
[null,null,null,null," ",null,null,0]
[null,null,null,null," ",null,null,0]
[null,null,null,null," ",null,null,0]
[null,null,null,null," ",null,null,0]
[null,null,null,null," ",null,null,0]
[null,null,null,null," ",null,null,0]
[null,null,null,null," ",null,null,0]
[null,null,null,null," ",null,null,0]
[null,null,null,null," ",null,null,0]
[null,null,null,null," ",null,null,0]
[null,null,null,null," ",null,null,0]
[null,null,null,null," ",null,null,0]
[null,null,null,null," ",null,null,0]
[null,null,null,null," ",null,null,0]
[null,null,null,null," ",null,null,0]
[null,null,null,null," ",null,null,0]
[null,null,null,null," ",null,null,0]
[null,null,null,null," ",null,null,0]
[null,null,null,null," ",null,null,0]
[null,null,null,null," ",null,null,0]
[null,null,null,null," ",null,null,0]
[null,null,null,null," ",null,null,0]
[null,null,null,null," ",null,null,0]
[null,null,null,null," ",null,null,0]
[null,null,null,null," ",null,null,0]
[null,null,null,null," ",null,null,0]
[null,null,null,null," ",null,null,0]
[null,null,null,null," ",null,null,0]
[null,null,null,null," ",null,null,0]
[null,null,null,null," ",null,null,0]
[null,null,null,null," ",null,null,0]
[null,null,null,null," ",null,null,0]
[null,null,null,null," ",null,null,0]
[null,null,null,null," ",null,null,0]
[null,null,null,null," ",null,null,0]
[null,null,null,null," ",null,null,0]
[null,null,null,null," ",null,null,0]
[null,null,null,null," ",null,null,0]
[null,null,null,null," ",null,null,0]
[null,null,null,null," ",null,null,0]
[null,null,null,null," ",null,null,0]
[null,null,null,null," ",null,null,0]
[null,null,null,null," ",null,null,0]
[null,null,null,null," ",null,null,0]
[null,null,null,null," ",null,null,0]
[null,null,null,null," ",null,null,0]
[null,null,null,null," ",null,null,0]
[null,null,null,null," ",null,null,0]
[null,null,null,null," ",null,null,0]
[null,null,null,null," ",null,null,0]
[null,null,null,null," ",null,null,0]
[null,null,null,null," ",null,null,0]
[null,null,null,null," ",null,null,0]
[null,null,null,null," ",null,null,0]
[null,null,null,null," ",null,null,0]
[null,null,null,null," ",null,null,0]
[null,null,null,null," ",null,null,0]
[null,null,null,null," ",null,null,0]
[null,null,null,null," ",null,null,0]
[null,null,null,null," ",null,null,0]
[null,null,null,null," ",null,null,0]
[null,null,null,null,{"$f":"IF(D2633>0,VLOOKUP(D2633,entidades,2,FALSE),\" \")","v":" "},null,null,{"$f":"+F2633+G2633","v":0}]
[null,null,null,null," ",null,null,0]
[null,null,null,null," ",null,null,0]
[null,null,null,null," ",null,null,0]
[null,null,null,null," ",null,null,0]
[null,null,null,null," ",null,null,0]
[null,null,null,null," ",null,null,0]
[null,null,null,null," ",null,null,0]
[null,null,null,null," ",null,null,0]
[null,null,null,null," ",null,null,0]
[null,null,null,null," ",null,null,0]
[null,null,null,null," ",null,null,0]
[null,null,null,null," ",null,null,0]
[null,null,null,null," ",null,null,0]
[null,null,null,null," ",null,null,0]
[null,null,null,null," ",null,null,0]
[null,null,null,null," ",null,null,0]
[null,null,null,null," ",null,null,0]
[null,null,null,null," ",null,null,0]
[null,null,null,null," ",null,null,0]
[null,null,null,null," ",null,null,0]
[null,null,null,null," ",null,null,0]
[null,null,null,null," ",null,null,0]
[null,null,null,null," ",null,null,0]
[null,null,null,null," ",null,null,0]
[null,null,null,null," ",null,null,0]
[null,null,null,null," ",null,null,0]
[null,null,null,null," ",null,null,0]
[null,null,null,null," ",null,null,0]
[null,null,null,null," ",null,null,0]
[null,null,null,null," ",null,null,0]
[null,null,null,null," ",null,null,0]
[null,null,null,null," ",null,null,0]
[null,null,null,null," ",null,null,0]
[null,null,null,null," ",null,null,0]
[null,null,null,null," ",null,null,0]
[null,null,null,null," ",null,null,0]
[null,null,null,null," ",null,null,0]
[null,null,null,null," ",null,null,0]
[null,null,null,null," ",null,null,0]
[null,null,null,null," ",null,null,0]
[null,null,null,null," ",null,null,0]
[null,null,null,null," ",null,null,0]
[null,null,null,null," ",null,null,0]
[null,null,null,null," ",null,null,0]
[null,null,null,null," ",null,null,0]
[null,null,null,null," ",null,null,0]
[null,null,null,null," ",null,null,0]
[null,null,null,null," ",null,null,0]
[null,null,null,null," ",null,null,0]
[null,null,null,null," ",null,null,0]
[null,null,null,null," ",null,null,0]
[null,null,null,null," ",null,null,0]
[null,null,null,null," ",null,null,0]
[null,null,null,null," ",null,null,0]
[null,null,null,null," ",null,null,0]
[null,null,null,null," ",null,null,0]
[null,null,null,null," ",null,null,0]
[null,null,null,null," ",null,null,0]
[null,null,null,null," ",null,null,0]
[null,null,null,null," ",null,null,0]
[null,null,null,null," ",null,null,0]
[null,null,null,null," ",null,null,0]
[null,null,null,null," ",null,null,0]
[null,null,null,null,{"$f":"IF(D2697>0,VLOOKUP(D2697,entidades,2,FALSE),\" \")","v":" "},null,null,{"$f":"+F2697+G2697","v":0}]
[null,null,null,null," ",null,null,0]
[null,null,null,null," ",null,null,0]
[null,null,null,null," ",null,null,0]
[null,null,null,null," ",null,null,0]
[null,null,null,null," ",null,null,0]
[null,null,null,null," ",null,null,0]
[null,null,null,null," ",null,null,0]
[null,null,null,null," ",null,null,0]
[null,null,null,null," ",null,null,0]
[null,null,null,null," ",null,null,0]
[null,null,null,null," ",null,null,0]
[null,null,null,null," ",null,null,0]
[null,null,null,null," ",null,null,0]
[null,null,null,null," ",null,null,0]
[null,null,null,null," ",null,null,0]
[null,null,null,null," ",null,null,0]
[null,null,null,null," ",null,null,0]
[null,null,null,null," ",null,null,0]
[null,null,null,null," ",null,null,0]
[null,null,null,null," ",null,null,0]
[null,null,null,null," ",null,null,0]
[null,null,null,null," ",null,null,0]
[null,null,null,null," ",null,null,0]
[null,null,null,null," ",null,null,0]
[null,null,null,null," ",null,null,0]
[null,null,null,null," ",null,null,0]
[null,null,null,null," ",null,null,0]
[null,null,null,null," ",null,null,0]
[null,null,null,null," ",null,null,0]
[null,null,null,null," ",null,null,0]
[null,null,null,null," ",null,null,0]
[null,null,null,null," ",null,null,0]
[null,null,null,null," ",null,null,0]
[null,null,null,null," ",null,null,0]
[null,null,null,null," ",null,null,0]
[null,null,null,null," ",null,null,0]
[null,null,null,null," ",null,null,0]
[null,null,null,null," ",null,null,0]
[null,null,null,null," ",null,null,0]
[null,null,null,null," ",null,null,0]
[null,null,null,null," ",null,null,0]
[null,null,null,null," ",null,null,0]
[null,null,null,null," ",null,null,0]
[null,null,null,null," ",null,null,0]
[null,null,null,null," ",null,null,0]
[null,null,null,null," ",null,null,0]
[null,null,null,null," ",null,null,0]
[null,null,null,null," ",null,null,0]
[null,null,null,null," ",null,null,0]
[null,null,null,null," ",null,null,0]
[null,null,null,null," ",null,null,0]
[null,null,null,null," ",null,null,0]
[null,null,null,null," ",null,null,0]
[null,null,null,null," ",null,null,0]
[null,null,null,null," ",null,null,0]
[null,null,null,null," ",null,null,0]
[null,null,null,null," ",null,null,0]
[null,null,null,null," ",null,null,0]
[null,null,null,null," ",null,null,0]
[null,null,null,null," ",null,null,0]
[null,null,null,null," ",null,null,0]
[null,null,null,null," ",null,null,0]
[null,null,null,null," ",null,null,0]
[null,null,null,null,{"$f":"IF(D2761>0,VLOOKUP(D2761,entidades,2,FALSE),\" \")","v":" "},null,null,{"$f":"+F2761+G2761","v":0}]
[null,null,null,null," ",null,null,0]
[null,null,null,null," ",null,null,0]
[null,null,null,null," ",null,null,0]
[null,null,null,null," ",null,null,0]
[null,null,null,null," ",null,null,0]
[null,null,null,null," ",null,null,0]
[null,null,null,null," ",null,null,0]
[null,null,null,null," ",null,null,0]
[null,null,null,null," ",null,null,0]
[null,null,null,null," ",null,null,0]
[null,null,null,null," ",null,null,0]
[null,null,null,null," ",null,null,0]
[null,null,null,null," ",null,null,0]
[null,null,null,null," ",null,null,0]
[null,null,null,null," ",null,null,0]
[null,null,null,null," ",null,null,0]
[null,null,null,null," ",null,null,0]
[null,null,null,null," ",null,null,0]
[null,null,null,null," ",null,null,0]
[null,null,null,null," ",null,null,0]
[null,null,null,null," ",null,null,0]
[null,null,null,null," ",null,null,0]
[null,null,null,null," ",null,null,0]
[null,null,null,null," ",null,null,0]
[null,null,null,null," ",null,null,0]
[null,null,null,null," ",null,null,0]
[null,null,null,null," ",null,null,0]
[null,null,null,null," ",null,null,0]
[null,null,null,null," ",null,null,0]
[null,null,null,null," ",null,null,0]
[null,null,null,null," ",null,null,0]
[null,null,null,null," ",null,null,0]
[null,null,null,null," ",null,null,0]
[null,null,null,null," ",null,null,0]
[null,null,null,null," ",null,null,0]
[null,null,null,null," ",null,null,0]
[null,null,null,null," ",null,null,0]
[null,null,null,null," ",null,null,0]
[null,null,null,null," ",null,null,0]
[null,null,null,null," ",null,null,0]
[null,null,null,null," ",null,null,0]
[null,null,null,null," ",null,null,0]
[null,null,null,null," ",null,null,0]
[null,null,null,null," ",null,null,0]
[null,null,null,null," ",null,null,0]
[null,null,null,null," ",null,null,0]
[null,null,null,null," ",null,null,0]
[null,null,null,null," ",null,null,0]
[null,null,null,null," ",null,null,0]
[null,null,null,null," ",null,null,0]
[null,null,null,null," ",null,null,0]
[null,null,null,null," ",null,null,0]
[null,null,null,null," ",null,null,0]
[null,null,null,null," ",null,null,0]
[null,null,null,null," ",null,null,0]
[null,null,null,null," ",null,null,0]
[null,null,null,null," ",null,null,0]
[null,null,null,null," ",null,null,0]
[null,null,null,null," ",null,null,0]
[null,null,null,null," ",null,null,0]
[null,null,null,null," ",null,null,0]
[null,null,null,null," ",null,null,0]
[null,null,null,null," ",null,null,0]
[null,null,null,null,{"$f":"IF(D2825>0,VLOOKUP(D2825,entidades,2,FALSE),\" \")","v":" "},null,null,{"$f":"+F2825+G2825","v":0}]
[null,null,null,null," ",null,null,0]
[null,null,null,null," ",null,null,0]
[null,null,null,null," ",null,null,0]
[null,null,null,null," ",null,null,0]
[null,null,null,null," ",null,null,0]
[null,null,null,null," ",null,null,0]
[null,null,null,null," ",null,null,0]
[null,null,null,null," ",null,null,0]
[null,null,null,null," ",null,null,0]
[null,null,null,null," ",null,null,0]
[null,null,null,null," ",null,null,0]
[null,null,null,null," ",null,null,0]
[null,null,null,null," ",null,null,0]
[null,null,null,null," ",null,null,0]
[null,null,null,null," ",null,null,0]
[null,null,null,null," ",null,null,0]
[null,null,null,null," ",null,null,0]
[null,null,null,null," ",null,null,0]
[null,null,null,null," ",null,null,0]
[null,null,null,null," ",null,null,0]
[null,null,null,null," ",null,null,0]
[null,null,null,null," ",null,null,0]
[null,null,null,null," ",null,null,0]
[null,null,null,null," ",null,null,0]
[null,null,null,null," ",null,null,0]
[null,null,null,null," ",null,null,0]
[null,null,null,null," ",null,null,0]
[null,null,null,null," ",null,null,0]
[null,null,null,null," ",null,null,0]
[null,null,null,null," ",null,null,0]
[null,null,null,null," ",null,null,0]
[null,null,null,null," ",null,null,0]
[null,null,null,null," ",null,null,0]
[null,null,null,null," ",null,null,0]
[null,null,null,null," ",null,null,0]
[null,null,null,null," ",null,null,0]
[null,null,null,null," ",null,null,0]
[null,null,null,null," ",null,null,0]
[null,null,null,null," ",null,null,0]
[null,null,null,null," ",null,null,0]
[null,null,null,null," ",null,null,0]
[null,null,null,null," ",null,null,0]
[null,null,null,null," ",null,null,0]
[null,null,null,null," ",null,null,0]
[null,null,null,null," ",null,null,0]
[null,null,null,null," ",null,null,0]
[null,null,null,null," ",null,null,0]
[null,null,null,null," ",null,null,0]
[null,null,null,null," ",null,null,0]
[null,null,null,null," ",null,null,0]
[null,null,null,null," ",null,null,0]
[null,null,null,null," ",null,null,0]
[null,null,null,null," ",null,null,0]
[null,null,null,null," ",null,null,0]
[null,null,null,null," ",null,null,0]
[null,null,null,null," ",null,null,0]
[null,null,null,null," ",null,null,0]
[null,null,null,null," ",null,null,0]
[null,null,null,null," ",null,null,0]
[null,null,null,null," ",null,null,0]
[null,null,null,null," ",null,null,0]
[null,null,null,null," ",null,null,0]
[null,null,null,null," ",null,null,0]
[null,null,null,null,{"$f":"IF(D2889>0,VLOOKUP(D2889,entidades,2,FALSE),\" \")","v":" "},null,null,{"$f":"+F2889+G2889","v":0}]
[null,null,null,null," ",null,null,0]
[null,null,null,null," ",null,null,0]
[null,null,null,null," ",null,null,0]
[null,null,null,null," ",null,null,0]
[null,null,null,null," ",null,null,0]
[null,null,null,null," ",null,null,0]
[null,null,null,null," ",null,null,0]
[null,null,null,null," ",null,null,0]
[null,null,null,null," ",null,null,0]
[null,null,null,null," ",null,null,0]
[null,null,null,null," ",null,null,0]
[null,null,null,null," ",null,null,0]
[null,null,null,null," ",null,null,0]
[null,null,null,null," ",null,null,0]
[null,null,null,null," ",null,null,0]
[null,null,null,null," ",null,null,0]
[null,null,null,null," ",null,null,0]
[null,null,null,null," ",null,null,0]
[null,null,null,null," ",null,null,0]
[null,null,null,null," ",null,null,0]
[null,null,null,null," ",null,null,0]
[null,null,null,null," ",null,null,0]
[null,null,null,null," ",null,null,0]
[null,null,null,null," ",null,null,0]
[null,null,null,null," ",null,null,0]
[null,null,null,null," ",null,null,0]
[null,null,null,null," ",null,null,0]
[null,null,null,null," ",null,null,0]
[null,null,null,null," ",null,null,0]
[null,null,null,null," ",null,null,0]
[null,null,null,null," ",null,null,0]
[null,null,null,null," ",null,null,0]
[null,null,null,null," ",null,null,0]
[null,null,null,null," ",null,null,0]
[null,null,null,null," ",null,null,0]
[null,null,null,null," ",null,null,0]
[null,null,null,null," ",null,null,0]
[null,null,null,null," ",null,null,0]
[null,null,null,null," ",null,null,0]
[null,null,null,null," ",null,null,0]
[null,null,null,null," ",null,null,0]
[null,null,null,null," ",null,null,0]
[null,null,null,null," ",null,null,0]
[null,null,null,null," ",null,null,0]
[null,null,null,null," ",null,null,0]
[null,null,null,null," ",null,null,0]
[null,null,null,null," ",null,null,0]
[null,null,null,null," ",null,null,0]
[null,null,null,null," ",null,null,0]
[null,null,null,null," ",null,null,0]
[null,null,null,null," ",null,null,0]
[null,null,null,null," ",null,null,0]
[null,null,null,null," ",null,null,0]
[null,null,null,null," ",null,null,0]
[null,null,null,null," ",null,null,0]
[null,null,null,null," ",null,null,0]
[null,null,null,null," ",null,null,0]
[null,null,null,null," ",null,null,0]
[null,null,null,null," ",null,null,0]
[null,null,null,null," ",null,null,0]
[null,null,null,null," ",null,null,0]
[null,null,null,null," ",null,null,0]
[null,null,null,null," ",null,null,0]
[null,null,null,null,{"$f":"IF(D2953>0,VLOOKUP(D2953,entidades,2,FALSE),\" \")","v":" "},null,null,{"$f":"+F2953+G2953","v":0}]
[null,null,null,null," ",null,null,0]
[null,null,null,null," ",null,null,0]
[null,null,null,null," ",null,null,0]
[null,null,null,null," ",null,null,0]
[null,null,null,null," ",null,null,0]
[null,null,null,null," ",null,null,0]
[null,null,null,null," ",null,null,0]
[null,null,null,null," ",null,null,0]
[null,null,null,null," ",null,null,0]
[null,null,null,null," ",null,null,0]
[null,null,null,null," ",null,null,0]
[null,null,null,null," ",null,null,0]
[null,null,null,null," ",null,null,0]
[null,null,null,null," ",null,null,0]
[null,null,null,null," ",null,null,0]
[null,null,null,null," ",null,null,0]
[null,null,null,null," ",null,null,0]
[null,null,null,null," ",null,null,0]
[null,null,null,null," ",null,null,0]
[null,null,null,null," ",null,null,0]
[null,null,null,null," ",null,null,0]
[null,null,null,null," ",null,null,0]
[null,null,null,null," ",null,null,0]
[null,null,null,null," ",null,null,0]
[null,null,null,null," ",null,null,0]
[null,null,null,null," ",null,null,0]
[null,null,null,null," ",null,null,0]
[null,null,null,null," ",null,null,0]
[null,null,null,null," ",null,null,0]
[null,null,null,null," ",null,null,0]
[null,null,null,null," ",null,null,0]
[null,null,null,null," ",null,null,0]
[null,null,null,null," ",null,null,0]
[null,null,null,null," ",null,null,0]
[null,null,null,null," ",null,null,0]
[null,null,null,null," ",null,null,0]
[null,null,null,null," ",null,null,0]
[null,null,null,null," ",null,null,0]
[null,null,null,null," ",null,null,0]
[null,null,null,null," ",null,null,0]
[null,null,null,null," ",null,null,0]
[null,null,null,null," ",null,null,0]
[null,null,null,null," ",null,null,0]
[null,null,null,null," ",null,null,0]
[null,null,null,null," ",null,null,0]
[null,null,null,null," ",null,null,0]
[null,null,null,null," ",null,null,0]
[null,null,null,null," ",null,null,0]
[null,null,null,null," ",null,null,0]
[null,null,null,null," ",null,null,0]
[null,null,null,null," ",null,null,0]
[null,null,null,null," ",null,null,0]
[null,null,null,null," ",null,null,0]
[null,null,null,null," ",null,null,0]
[null,null,null,null," ",null,null,0]
[null,null,null,null," ",null,null,0]
[null,null,null,null," ",null,null,0]
[null,null,null,null," ",null,null,0]
[null,null,null,null," ",null,null,0]
[null,null,null,null," ",null,null,0]
[null,null,null,null," ",null,null,0]
[null,null,null,null," ",null,null,0]
[null,null,null,null," ",null,null,0]
[null,null,null,null,{"$f":"IF(D3017>0,VLOOKUP(D3017,entidades,2,FALSE),\" \")","v":" "},null,null,{"$f":"+F3017+G3017","v":0}]
[null,null,null,null," ",null,null,0]
[null,null,null,null," ",null,null,0]
[null,null,null,null," ",null,null,0]
[null,null,null,null," ",null,null,0]
[null,null,null,null," ",null,null,0]
[null,null,null,null," ",null,null,0]
[null,null,null,null," ",null,null,0]
[null,null,null,null," ",null,null,0]
[null,null,null,null," ",null,null,0]
[null,null,null,null," ",null,null,0]
[null,null,null,null," ",null,null,0]
[null,null,null,null," ",null,null,0]
[null,null,null,null," ",null,null,0]
[null,null,null,null," ",null,null,0]
[null,null,null,null," ",null,null,0]
[null,null,null,null," ",null,null,0]
[null,null,null,null," ",null,null,0]
[null,null,null,null," ",null,null,0]
[null,null,null,null," ",null,null,0]
[null,null,null,null," ",null,null,0]
[null,null,null,null," ",null,null,0]
[null,null,null,null," ",null,null,0]
[null,null,null,null," ",null,null,0]
[null,null,null,null," ",null,null,0]
[null,null,null,null," ",null,null,0]
[null,null,null,null," ",null,null,0]
[null,null,null,null," ",null,null,0]
[null,null,null,null," ",null,null,0]
[null,null,null,null," ",null,null,0]
[null,null,null,null," ",null,null,0]
[null,null,null,null," ",null,null,0]
[null,null,null,null," ",null,null,0]
[null,null,null,null," ",null,null,0]
[null,null,null,null," ",null,null,0]
[null,null,null,null," ",null,null,0]
[null,null,null,null," ",null,null,0]
[null,null,null,null," ",null,null,0]
[null,null,null,null," ",null,null,0]
[null,null,null,null," ",null,null,0]
[null,null,null,null," ",null,null,0]
[null,null,null,null," ",null,null,0]
[null,null,null,null," ",null,null,0]
[null,null,null,null," ",null,null,0]
[null,null,null,null," ",null,null,0]
[null,null,null,null," ",null,null,0]
[null,null,null,null," ",null,null,0]
[null,null,null,null," ",null,null,0]
[null,null,null,null," ",null,null,0]
[null,null,null,null," ",null,null,0]
[null,null,null,null," ",null,null,0]
[null,null,null,null," ",null,null,0]
[null,null,null,null," ",null,null,0]
[null,null,null,null," ",null,null,0]
[null,null,null,null," ",null,null,0]
[null,null,null,null," ",null,null,0]
[null,null,null,null," ",null,null,0]
[null,null,null,null," ",null,null,0]
[null,null,null,null," ",null,null,0]
[null,null,null,null," ",null,null,0]
[null,null,null,null," ",null,null,0]
[null,null,null,null," ",null,null,0]
[null,null,null,null," ",null,null,0]
[null,null,null,null," ",null,null,0]
[null,null,null,null,{"$f":"IF(D3081>0,VLOOKUP(D3081,entidades,2,FALSE),\" \")","v":" "},null,null,{"$f":"+F3081+G3081","v":0}]
[null,null,null,null," ",null,null,0]
[null,null,null,null," ",null,null,0]
[null,null,null,null," ",null,null,0]
[null,null,null,null," ",null,null,0]
[null,null,null,null," ",null,null,0]
[null,null,null,null," ",null,null,0]
[null,null,null,null," ",null,null,0]
[null,null,null,null," ",null,null,0]
[null,null,null,null," ",null,null,0]
[null,null,null,null," ",null,null,0]
[null,null,null,null," ",null,null,0]
[null,null,null,null," ",null,null,0]
[null,null,null,null," ",null,null,0]
[null,null,null,null," ",null,null,0]
[null,null,null,null," ",null,null,0]
[null,null,null,null," ",null,null,0]
[null,null,null,null," ",null,null,0]
[null,null,null,null," ",null,null,0]
[null,null,null,null," ",null,null,0]
[null,null,null,null," ",null,null,0]
[null,null,null,null," ",null,null,0]
[null,null,null,null," ",null,null,0]
[null,null,null,null," ",null,null,0]
[null,null,null,null," ",null,null,0]
[null,null,null,null," ",null,null,0]
[null,null,null,null," ",null,null,0]
[null,null,null,null," ",null,null,0]
[null,null,null,null," ",null,null,0]
[null,null,null,null," ",null,null,0]
[null,null,null,null," ",null,null,0]
[null,null,null,null," ",null,null,0]
[null,null,null,null," ",null,null,0]
[null,null,null,null," ",null,null,0]
[null,null,null,null," ",null,null,0]
[null,null,null,null," ",null,null,0]
[null,null,null,null," ",null,null,0]
[null,null,null,null," ",null,null,0]
[null,null,null,null," ",null,null,0]
[null,null,null,null," ",null,null,0]
[null,null,null,null," ",null,null,0]
[null,null,null,null," ",null,null,0]
[null,null,null,null," ",null,null,0]
[null,null,null,null," ",null,null,0]
[null,null,null,null," ",null,null,0]
[null,null,null,null," ",null,null,0]
[null,null,null,null," ",null,null,0]
[null,null,null,null," ",null,null,0]
[null,null,null,null," ",null,null,0]
[null,null,null,null," ",null,null,0]
[null,null,null,null," ",null,null,0]
[null,null,null,null," ",null,null,0]
[null,null,null,null," ",null,null,0]
[null,null,null,null," ",null,null,0]
[null,null,null,null," ",null,null,0]
[null,null,null,null," ",null,null,0]
[null,null,null,null," ",null,null,0]
[null,null,null,null," ",null,null,0]
[null,null,null,null," ",null,null,0]
[null,null,null,null," ",null,null,0]
[null,null,null,null," ",null,null,0]
[null,null,null,null," ",null,null,0]
[null,null,null,null," ",null,null,0]
[null,null,null,null," ",null,null,0]
[null,null,null,null,{"$f":"IF(D3145>0,VLOOKUP(D3145,entidades,2,FALSE),\" \")","v":" "},null,null,{"$f":"+F3145+G3145","v":0}]
[null,null,null,null," ",null,null,0]
[null,null,null,null," ",null,null,0]
[null,null,null,null," ",null,null,0]
[null,null,null,null," ",null,null,0]
[null,null,null,null," ",null,null,0]
[null,null,null,null," ",null,null,0]
[null,null,null,null," ",null,null,0]
[null,null,null,null," ",null,null,0]
[null,null,null,null," ",null,null,0]
[null,null,null,null," ",null,null,0]
[null,null,null,null," ",null,null,0]
[null,null,null,null," ",null,null,0]
[null,null,null,null," ",null,null,0]
[null,null,null,null," ",null,null,0]
[null,null,null,null," ",null,null,0]
[null,null,null,null," ",null,null,0]
[null,null,null,null," ",null,null,0]
[null,null,null,null," ",null,null,0]
[null,null,null,null," ",null,null,0]
[null,null,null,null," ",null,null,0]
[null,null,null,null," ",null,null,0]
[null,null,null,null," ",null,null,0]
[null,null,null,null," ",null,null,0]
[null,null,null,null," ",null,null,0]
[null,null,null,null," ",null,null,0]
[null,null,null,null," ",null,null,0]
[null,null,null,null," ",null,null,0]
[null,null,null,null," ",null,null,0]
[null,null,null,null," ",null,null,0]
[null,null,null,null," ",null,null,0]
[null,null,null,null," ",null,null,0]
[null,null,null,null," ",null,null,0]
[null,null,null,null," ",null,null,0]
[null,null,null,null," ",null,null,0]
[null,null,null,null," ",null,null,0]
[null,null,null,null," ",null,null,0]
[null,null,null,null," ",null,null,0]
[null,null,null,null," ",null,null,0]
[null,null,null,null," ",null,null,0]
[null,null,null,null," ",null,null,0]
[null,null,null,null," ",null,null,0]
[null,null,null,null," ",null,null,0]
[null,null,null,null," ",null,null,0]
[null,null,null,null," ",null,null,0]
[null,null,null,null," ",null,null,0]
[null,null,null,null," ",null,null,0]
[null,null,null,null," ",null,null,0]
[null,null,null,null," ",null,null,0]
[null,null,null,null," ",null,null,0]
[null,null,null,null," ",null,null,0]
[null,null,null,null," ",null,null,0]
[null,null,null,null," ",null,null,0]
[null,null,null,null," ",null,null,0]
[null,null,null,null," ",null,null,0]
[null,null,null,null," ",null,null,0]
[null,null,null,null," ",null,null,0]
[null,null,null,null," ",null,null,0]
[null,null,null,null," ",null,null,0]
[null,null,null,null," ",null,null,0]
[null,null,null,null," ",null,null,0]
[null,null,null,null," ",null,null,0]
[null,null,null,null," ",null,null,0]
[null,null,null,null," ",null,null,0]
[null,null,null,null,{"$f":"IF(D3209>0,VLOOKUP(D3209,entidades,2,FALSE),\" \")","v":" "},null,null,{"$f":"+F3209+G3209","v":0}]
[null,null,null,null," ",null,null,0]
[null,null,null,null," ",null,null,0]
[null,null,null,null," ",null,null,0]
[null,null,null,null," ",null,null,0]
[null,null,null,null," ",null,null,0]
[null,null,null,null," ",null,null,0]
[null,null,null,null," ",null,null,0]
[null,null,null,null," ",null,null,0]
[null,null,null,null," ",null,null,0]
[null,null,null,null," ",null,null,0]
[null,null,null,null," ",null,null,0]
[null,null,null,null," ",null,null,0]
[null,null,null,null," ",null,null,0]
[null,null,null,null," ",null,null,0]
[null,null,null,null," ",null,null,0]
[null,null,null,null," ",null,null,0]
[null,null,null,null," ",null,null,0]
[null,null,null,null," ",null,null,0]
[null,null,null,null," ",null,null,0]
[null,null,null,null," ",null,null,0]
[null,null,null,null," ",null,null,0]
[null,null,null,null," ",null,null,0]
[null,null,null,null," ",null,null,0]
[null,null,null,null," ",null,null,0]
[null,null,null,null," ",null,null,0]
[null,null,null,null," ",null,null,0]
[null,null,null,null," ",null,null,0]
[null,null,null,null," ",null,null,0]
[null,null,null,null," ",null,null,0]
[null,null,null,null," ",null,null,0]
[null,null,null,null," ",null,null,0]
[null,null,null,null," ",null,null,0]
[null,null,null,null," ",null,null,0]
[null,null,null,null," ",null,null,0]
[null,null,null,null," ",null,null,0]
[null,null,null,null," ",null,null,0]
[null,null,null,null," ",null,null,0]
[null,null,null,null," ",null,null,0]
[null,null,null,null," ",null,null,0]
[null,null,null,null," ",null,null,0]
[null,null,null,null," ",null,null,0]
[null,null,null,null," ",null,null,0]
[null,null,null,null," ",null,null,0]
[null,null,null,null," ",null,null,0]
[null,null,null,null," ",null,null,0]
[null,null,null,null," ",null,null,0]
[null,null,null,null," ",null,null,0]
[null,null,null,null," ",null,null,0]
[null,null,null,null," ",null,null,0]
[null,null,null,null," ",null,null,0]
[null,null,null,null," ",null,null,0]
[null,null,null,null," ",null,null,0]
[null,null,null,null," ",null,null,0]
[null,null,null,null," ",null,null,0]
[null,null,null,null," ",null,null,0]
[null,null,null,null," ",null,null,0]
[null,null,null,null," ",null,null,0]
[null,null,null,null," ",null,null,0]
[null,null,null,null," ",null,null,0]
[null,null,null,null," ",null,null,0]
[null,null,null,null," ",null,null,0]
[null,null,null,null," ",null,null,0]
[null,null,null,null," ",null,null,0]
[null,null,null,null,{"$f":"IF(D3273>0,VLOOKUP(D3273,entidades,2,FALSE),\" \")","v":" "},null,null,{"$f":"+F3273+G3273","v":0}]
[null,null,null,null," ",null,null,0]
[null,null,null,null," ",null,null,0]
[null,null,null,null," ",null,null,0]
[null,null,null,null," ",null,null,0]
[null,null,null,null," ",null,null,0]
[null,null,null,null," ",null,null,0]
[null,null,null,null," ",null,null,0]
[null,null,null,null," ",null,null,0]
[null,null,null,null," ",null,null,0]
[null,null,null,null," ",null,null,0]
[null,null,null,null," ",null,null,0]
[null,null,null,null," ",null,null,0]
[null,null,null,null," ",null,null,0]
[null,null,null,null," ",null,null,0]
[null,null,null,null," ",null,null,0]
[null,null,null,null," ",null,null,0]
[null,null,null,null," ",null,null,0]
[null,null,null,null," ",null,null,0]
[null,null,null,null," ",null,null,0]
[null,null,null,null," ",null,null,0]
[null,null,null,null," ",null,null,0]
[null,null,null,null," ",null,null,0]
[null,null,null,null," ",null,null,0]
[null,null,null,null," ",null,null,0]
[null,null,null,null," ",null,null,0]
[null,null,null,null," ",null,null,0]
[null,null,null,null," ",null,null,0]
[null,null,null,null," ",null,null,0]
[null,null,null,null," ",null,null,0]
[null,null,null,null," ",null,null,0]
[null,null,null,null," ",null,null,0]
[null,null,null,null," ",null,null,0]
[null,null,null,null," ",null,null,0]
[null,null,null,null," ",null,null,0]
[null,null,null,null," ",null,null,0]
[null,null,null,null," ",null,null,0]
[null,null,null,null," ",null,null,0]
[null,null,null,null," ",null,null,0]
[null,null,null,null," ",null,null,0]
[null,null,null,null," ",null,null,0]
[null,null,null,null," ",null,null,0]
[null,null,null,null," ",null,null,0]
[null,null,null,null," ",null,null,0]
[null,null,null,null," ",null,null,0]
[null,null,null,null," ",null,null,0]
[null,null,null,null," ",null,null,0]
[null,null,null,null," ",null,null,0]
[null,null,null,null," ",null,null,0]
[null,null,null,null," ",null,null,0]
[null,null,null,null," ",null,null,0]
[null,null,null,null," ",null,null,0]
[null,null,null,null," ",null,null,0]
[null,null,null,null," ",null,null,0]
[null,null,null,null," ",null,null,0]
[null,null,null,null," ",null,null,0]
[null,null,null,null," ",null,null,0]
[null,null,null,null," ",null,null,0]
[null,null,null,null," ",null,null,0]
[null,null,null,null," ",null,null,0]
[null,null,null,null," ",null,null,0]
[null,null,null,null," ",null,null,0]
[null,null,null,null," ",null,null,0]
[null,null,null,null," ",null,null,0]
[null,null,null,null,{"$f":"IF(D3337>0,VLOOKUP(D3337,entidades,2,FALSE),\" \")","v":" "},null,null,{"$f":"+F3337+G3337","v":0}]
[null,null,null,null," ",null,null,0]
[null,null,null,null," ",null,null,0]
[null,null,null,null," ",null,null,0]
[null,null,null,null," ",null,null,0]
[null,null,null,null," ",null,null,0]
[null,null,null,null," ",null,null,0]
[null,null,null,null," ",null,null,0]
[null,null,null,null," ",null,null,0]
[null,null,null,null," ",null,null,0]
[null,null,null,null," ",null,null,0]
[null,null,null,null," ",null,null,0]
[null,null,null,null," ",null,null,0]
[null,null,null,null," ",null,null,0]
[null,null,null,null," ",null,null,0]
[null,null,null,null," ",null,null,0]
[null,null,null,null," ",null,null,0]
[null,null,null,null," ",null,null,0]
[null,null,null,null," ",null,null,0]
[null,null,null,null," ",null,null,0]
[null,null,null,null," ",null,null,0]
[null,null,null,null," ",null,null,0]
[null,null,null,null," ",null,null,0]
[null,null,null,null," ",null,null,0]
[null,null,null,null," ",null,null,0]
[null,null,null,null," ",null,null,0]
[null,null,null,null," ",null,null,0]
[null,null,null,null," ",null,null,0]
[null,null,null,null," ",null,null,0]
[null,null,null,null," ",null,null,0]
[null,null,null,null," ",null,null,0]
[null,null,null,null," ",null,null,0]
[null,null,null,null," ",null,null,0]
[null,null,null,null," ",null,null,0]
[null,null,null,null," ",null,null,0]
[null,null,null,null," ",null,null,0]
[null,null,null,null," ",null,null,0]
[null,null,null,null," ",null,null,0]
[null,null,null,null," ",null,null,0]
[null,null,null,null," ",null,null,0]
[null,null,null,null," ",null,null,0]
[null,null,null,null," ",null,null,0]
[null,null,null,null," ",null,null,0]
[null,null,null,null," ",null,null,0]
[null,null,null,null," ",null,null,0]
[null,null,null,null," ",null,null,0]
[null,null,null,null," ",null,null,0]
[null,null,null,null," ",null,null,0]
[null,null,null,null," ",null,null,0]
[null,null,null,null," ",null,null,0]
[null,null,null,null," ",null,null,0]
[null,null,null,null," ",null,null,0]
[null,null,null,null," ",null,null,0]
[null,null,null,null," ",null,null,0]
[null,null,null,null," ",null,null,0]
[null,null,null,null," ",null,null,0]
[null,null,null,null," ",null,null,0]
[null,null,null,null," ",null,null,0]
[null,null,null,null," ",null,null,0]
[null,null,null,null," ",null,null,0]
[null,null,null,null," ",null,null,0]
[null,null,null,null," ",null,null,0]
[null,null,null,null," ",null,null,0]
[null,null,null,null," ",null,null,0]
[null,null,null,null,{"$f":"IF(D3401>0,VLOOKUP(D3401,entidades,2,FALSE),\" \")","v":" "},null,null,{"$f":"+F3401+G3401","v":0}]
[null,null,null,null," ",null,null,0]
[null,null,null,null," ",null,null,0]
[null,null,null,null," ",null,null,0]
[null,null,null,null," ",null,null,0]
[null,null,null,null," ",null,null,0]
[null,null,null,null," ",null,null,0]
[null,null,null,null," ",null,null,0]
[null,null,null,null," ",null,null,0]
[null,null,null,null," ",null,null,0]
[null,null,null,null," ",null,null,0]
[null,null,null,null," ",null,null,0]
[null,null,null,null," ",null,null,0]
[null,null,null,null," ",null,null,0]
[null,null,null,null," ",null,null,0]
[null,null,null,null," ",null,null,0]
[null,null,null,null," ",null,null,0]
[null,null,null,null," ",null,null,0]
[null,null,null,null," ",null,null,0]
[null,null,null,null," ",null,null,0]
[null,null,null,null," ",null,null,0]
[null,null,null,null," ",null,null,0]
[null,null,null,null," ",null,null,0]
[null,null,null,null," ",null,null,0]
[null,null,null,null," ",null,null,0]
[null,null,null,null," ",null,null,0]
[null,null,null,null," ",null,null,0]
[null,null,null,null," ",null,null,0]
[null,null,null,null," ",null,null,0]
[null,null,null,null," ",null,null,0]
[null,null,null,null," ",null,null,0]
[null,null,null,null," ",null,null,0]
[null,null,null,null," ",null,null,0]
[null,null,null,null," ",null,null,0]
[null,null,null,null," ",null,null,0]
[null,null,null,null," ",null,null,0]
[null,null,null,null," ",null,null,0]
[null,null,null,null," ",null,null,0]
[null,null,null,null," ",null,null,0]
[null,null,null,null," ",null,null,0]
[null,null,null,null," ",null,null,0]
[null,null,null,null," ",null,null,0]
[null,null,null,null," ",null,null,0]
[null,null,null,null," ",null,null,0]
[null,null,null,null," ",null,null,0]
[null,null,null,null," ",null,null,0]
[null,null,null,null," ",null,null,0]
[null,null,null,null," ",null,null,0]
[null,null,null,null," ",null,null,0]
[null,null,null,null," ",null,null,0]
[null,null,null,null," ",null,null,0]
[null,null,null,null," ",null,null,0]
[null,null,null,null," ",null,null,0]
[null,null,null,null," ",null,null,0]
[null,null,null,null," ",null,null,0]
[null,null,null,null," ",null,null,0]
[null,null,null,null," ",null,null,0]
[null,null,null,null," ",null,null,0]
[null,null,null,null," ",null,null,0]
[null,null,null,null," ",null,null,0]
[null,null,null,null," ",null,null,0]
[null,null,null,null," ",null,null,0]
[null,null,null,null," ",null,null,0]
[null,null,null,null," ",null,null,0]
[null,null,null,null,{"$f":"IF(D3465>0,VLOOKUP(D3465,entidades,2,FALSE),\" \")","v":" "},null,null,{"$f":"+F3465+G3465","v":0}]
[null,null,null,null," ",null,null,0]
[null,null,null,null," ",null,null,0]
[null,null,null,null," ",null,null,0]
[null,null,null,null," ",null,null,0]
[null,null,null,null," ",null,null,0]
[null,null,null,null," ",null,null,0]
[null,null,null,null," ",null,null,0]
[null,null,null,null," ",null,null,0]
[null,null,null,null," ",null,null,0]
[null,null,null,null," ",null,null,0]
[null,null,null,null," ",null,null,0]
[null,null,null,null," ",null,null,0]
[null,null,null,null," ",null,null,0]
[null,null,null,null," ",null,null,0]
[null,null,null,null," ",null,null,0]
[null,null,null,null," ",null,null,0]
[null,null,null,null," ",null,null,0]
[null,null,null,null," ",null,null,0]
[null,null,null,null," ",null,null,0]
[null,null,null,null," ",null,null,0]
[null,null,null,null," ",null,null,0]
[null,null,null,null," ",null,null,0]
[null,null,null,null," ",null,null,0]
[null,null,null,null," ",null,null,0]
[null,null,null,null," ",null,null,0]
[null,null,null,null," ",null,null,0]
[null,null,null,null," ",null,null,0]
[null,null,null,null," ",null,null,0]
[null,null,null,null," ",null,null,0]
[null,null,null,null," ",null,null,0]
[null,null,null,null," ",null,null,0]
[null,null,null,null," ",null,null,0]
[null,null,null,null," ",null,null,0]
[null,null,null,null," ",null,null,0]
[null,null,null,null," ",null,null,0]
[null,null,null,null," ",null,null,0]
[null,null,null,null," ",null,null,0]
[null,null,null,null," ",null,null,0]
[null,null,null,null," ",null,null,0]
[null,null,null,null," ",null,null,0]
[null,null,null,null," ",null,null,0]
[null,null,null,null," ",null,null,0]
[null,null,null,null," ",null,null,0]
[null,null,null,null," ",null,null,0]
[null,null,null,null," ",null,null,0]
[null,null,null,null," ",null,null,0]
[null,null,null,null," ",null,null,0]
[null,null,null,null," ",null,null,0]
[null,null,null,null," ",null,null,0]
[null,null,null,null," ",null,null,0]
[null,null,null,null," ",null,null,0]
[null,null,null,null," ",null,null,0]
[null,null,null,null," ",null,null,0]
[null,null,null,null," ",null,null,0]
[null,null,null,null," ",null,null,0]
[null,null,null,null," ",null,null,0]
[null,null,null,null," ",null,null,0]
[null,null,null,null," ",null,null,0]
[null,null,null,null," ",null,null,0]
[null,null,null,null," ",null,null,0]
[null,null,null,null," ",null,null,0]
[null,null,null,null," ",null,null,0]
[null,null,null,null," ",null,null,0]
[null,null,null,null,{"$f":"IF(D3529>0,VLOOKUP(D3529,entidades,2,FALSE),\" \")","v":" "},null,null,{"$f":"+F3529+G3529","v":0}]
[null,null,null,null," ",null,null,0]
[null,null,null,null," ",null,null,0]
[null,null,null,null," ",null,null,0]
[null,null,null,null," ",null,null,0]
[null,null,null,null," ",null,null,0]
[null,null,null,null," ",null,null,0]
[null,null,null,null," ",null,null,0]
[null,null,null,null," ",null,null,0]
[null,null,null,null," ",null,null,0]
[null,null,null,null," ",null,null,0]
[null,null,null,null," ",null,null,0]
[null,null,null,null," ",null,null,0]
[null,null,null,null," ",null,null,0]
[null,null,null,null," ",null,null,0]
[null,null,null,null," ",null,null,0]
[null,null,null,null," ",null,null,0]
[null,null,null,null," ",null,null,0]
[null,null,null,null," ",null,null,0]
[null,null,null,null," ",null,null,0]
[null,null,null,null," ",null,null,0]
[null,null,null,null," ",null,null,0]
[null,null,null,null," ",null,null,0]
[null,null,null,null," ",null,null,0]
[null,null,null,null," ",null,null,0]
[null,null,null,null," ",null,null,0]
[null,null,null,null," ",null,null,0]
[null,null,null,null," ",null,null,0]
[null,null,null,null," ",null,null,0]
[null,null,null,null," ",null,null,0]
[null,null,null,null," ",null,null,0]
[null,null,null,null," ",null,null,0]
[null,null,null,null," ",null,null,0]
[null,null,null,null," ",null,null,0]
[null,null,null,null," ",null,null,0]
[null,null,null,null," ",null,null,0]
[null,null,null,null," ",null,null,0]
[null,null,null,null," ",null,null,0]
[null,null,null,null," ",null,null,0]
[null,null,null,null," ",null,null,0]
[null,null,null,null," ",null,null,0]
[null,null,null,null," ",null,null,0]
[null,null,null,null," ",null,null,0]
[null,null,null,null," ",null,null,0]
[null,null,null,null," ",null,null,0]
[null,null,null,null," ",null,null,0]
[null,null,null,null," ",null,null,0]
[null,null,null,null," ",null,null,0]
[null,null,null,null," ",null,null,0]
[null,null,null,null," ",null,null,0]
[null,null,null,null," ",null,null,0]
[null,null,null,null," ",null,null,0]
[null,null,null,null," ",null,null,0]
[null,null,null,null," ",null,null,0]
[null,null,null,null," ",null,null,0]
[null,null,null,null," ",null,null,0]
[null,null,null,null," ",null,null,0]
[null,null,null,null," ",null,null,0]
[null,null,null,null," ",null,null,0]
[null,null,null,null," ",null,null,0]
[null,null,null,null," ",null,null,0]
[null,null,null,null," ",null,null,0]
[null,null,null,null," ",null,null,0]
[null,null,null,null," ",null,null,0]
[null,null,null,null,{"$f":"IF(D3593>0,VLOOKUP(D3593,entidades,2,FALSE),\" \")","v":" "},null,null,{"$f":"+F3593+G3593","v":0}]
[null,null,null,null," ",null,null,0]
[null,null,null,null," ",null,null,0]
[null,null,null,null," ",null,null,0]
[null,null,null,null," ",null,null,0]
[null,null,null,null," ",null,null,0]
[null,null,null,null," ",null,null,0]
[null,null,null,null," ",null,null,0]
[null,null,null,null," ",null,null,0]
[null,null,null,null," ",null,null,0]
[null,null,null,null," ",null,null,0]
[null,null,null,null," ",null,null,0]
[null,null,null,null," ",null,null,0]
[null,null,null,null," ",null,null,0]
[null,null,null,null," ",null,null,0]
[null,null,null,null," ",null,null,0]
[null,null,null,null," ",null,null,0]
[null,null,null,null," ",null,null,0]
[null,null,null,null," ",null,null,0]
[null,null,null,null," ",null,null,0]
[null,null,null,null," ",null,null,0]
[null,null,null,null," ",null,null,0]
[null,null,null,null," ",null,null,0]
[null,null,null,null," ",null,null,0]
[null,null,null,null," ",null,null,0]
[null,null,null,null," ",null,null,0]
[null,null,null,null," ",null,null,0]
[null,null,null,null," ",null,null,0]
[null,null,null,null," ",null,null,0]
[null,null,null,null," ",null,null,0]
[null,null,null,null," ",null,null,0]
[null,null,null,null," ",null,null,0]
[null,null,null,null," ",null,null,0]
[null,null,null,null," ",null,null,0]
[null,null,null,null," ",null,null,0]
[null,null,null,null," ",null,null,0]
[null,null,null,null," ",null,null,0]
[null,null,null,null," ",null,null,0]
[null,null,null,null," ",null,null,0]
[null,null,null,null," ",null,null,0]
[null,null,null,null," ",null,null,0]
[null,null,null,null," ",null,null,0]
[null,null,null,null," ",null,null,0]
[null,null,null,null," ",null,null,0]
[null,null,null,null," ",null,null,0]
[null,null,null,null," ",null,null,0]
[null,null,null,null," ",null,null,0]
[null,null,null,null," ",null,null,0]
[null,null,null,null," ",null,null,0]
[null,null,null,null," ",null,null,0]
[null,null,null,null," ",null,null,0]
[null,null,null,null," ",null,null,0]
[null,null,null,null," ",null,null,0]
[null,null,null,null," ",null,null,0]
[null,null,null,null," ",null,null,0]
[null,null,null,null," ",null,null,0]
[null,null,null,null," ",null,null,0]
[null,null,null,null," ",null,null,0]
[null,null,null,null," ",null,null,0]
[null,null,null,null," ",null,null,0]
[null,null,null,null," ",null,null,0]
[null,null,null,null," ",null,null,0]
[null,null,null,null," ",null,null,0]
[null,null,null,null," ",null,null,0]
[null,null,null,null,{"$f":"IF(D3657>0,VLOOKUP(D3657,entidades,2,FALSE),\" \")","v":" "},null,null,{"$f":"+F3657+G3657","v":0}]
[null,null,null,null," ",null,null,0]
[null,null,null,null," ",null,null,0]
[null,null,null,null," ",null,null,0]
[null,null,null,null," ",null,null,0]
[null,null,null,null," ",null,null,0]
[null,null,null,null," ",null,null,0]
[null,null,null,null," ",null,null,0]
[null,null,null,null," ",null,null,0]
[null,null,null,null," ",null,null,0]
[null,null,null,null," ",null,null,0]
[null,null,null,null," ",null,null,0]
[null,null,null,null," ",null,null,0]
[null,null,null,null," ",null,null,0]
[null,null,null,null," ",null,null,0]
[null,null,null,null," ",null,null,0]
[null,null,null,null," ",null,null,0]
[null,null,null,null," ",null,null,0]
[null,null,null,null," ",null,null,0]
[null,null,null,null," ",null,null,0]
[null,null,null,null," ",null,null,0]
[null,null,null,null," ",null,null,0]
[null,null,null,null," ",null,null,0]
[null,null,null,null," ",null,null,0]
[null,null,null,null," ",null,null,0]
[null,null,null,null," ",null,null,0]
[null,null,null,null," ",null,null,0]
[null,null,null,null," ",null,null,0]
[null,null,null,null," ",null,null,0]
[null,null,null,null," ",null,null,0]
[null,null,null,null," ",null,null,0]
[null,null,null,null," ",null,null,0]
[null,null,null,null," ",null,null,0]
[null,null,null,null," ",null,null,0]
[null,null,null,null," ",null,null,0]
[null,null,null,null," ",null,null,0]
[null,null,null,null," ",null,null,0]
[null,null,null,null," ",null,null,0]
[null,null,null,null," ",null,null,0]
[null,null,null,null," ",null,null,0]
[null,null,null,null," ",null,null,0]
[null,null,null,null," ",null,null,0]
[null,null,null,null," ",null,null,0]
[null,null,null,null," ",null,null,0]
[null,null,null,null," ",null,null,0]
[null,null,null,null," ",null,null,0]
[null,null,null,null," ",null,null,0]
[null,null,null,null," ",null,null,0]
[null,null,null,null," ",null,null,0]
[null,null,null,null," ",null,null,0]
[null,null,null,null," ",null,null,0]
[null,null,null,null," ",null,null,0]
[null,null,null,null," ",null,null,0]
[null,null,null,null," ",null,null,0]
[null,null,null,null," ",null,null,0]
[null,null,null,null," ",null,null,0]
[null,null,null,null," ",null,null,0]
[null,null,null,null," ",null,null,0]
[null,null,null,null," ",null,null,0]
[null,null,null,null," ",null,null,0]
[null,null,null,null," ",null,null,0]
[null,null,null,null," ",null,null,0]
[null,null,null,null," ",null,null,0]
[null,null,null,null," ",null,null,0]
[null,null,null,null,{"$f":"IF(D3721>0,VLOOKUP(D3721,entidades,2,FALSE),\" \")","v":" "},null,null,{"$f":"+F3721+G3721","v":0}]
[null,null,null,null," ",null,null,0]
[null,null,null,null," ",null,null,0]
[null,null,null,null," ",null,null,0]
[null,null,null,null," ",null,null,0]
[null,null,null,null," ",null,null,0]
[null,null,null,null," ",null,null,0]
[null,null,null,null," ",null,null,0]
[null,null,null,null," ",null,null,0]
[null,null,null,null," ",null,null,0]
[null,null,null,null," ",null,null,0]
[null,null,null,null," ",null,null,0]
[null,null,null,null," ",null,null,0]
[null,null,null,null," ",null,null,0]
[null,null,null,null," ",null,null,0]
[null,null,null,null," ",null,null,0]
[null,null,null,null," ",null,null,0]
[null,null,null,null," ",null,null,0]
[null,null,null,null," ",null,null,0]
[null,null,null,null," ",null,null,0]
[null,null,null,null," ",null,null,0]
[null,null,null,null," ",null,null,0]
[null,null,null,null," ",null,null,0]
[null,null,null,null," ",null,null,0]
[null,null,null,null," ",null,null,0]
[null,null,null,null," ",null,null,0]
[null,null,null,null," ",null,null,0]
[null,null,null,null," ",null,null,0]
[null,null,null,null," ",null,null,0]
[null,null,null,null," ",null,null,0]
[null,null,null,null," ",null,null,0]
[null,null,null,null," ",null,null,0]
[null,null,null,null," ",null,null,0]
[null,null,null,null," ",null,null,0]
[null,null,null,null," ",null,null,0]
[null,null,null,null," ",null,null,0]
[null,null,null,null," ",null,null,0]
[null,null,null,null," ",null,null,0]
[null,null,null,null," ",null,null,0]
[null,null,null,null," ",null,null,0]
[null,null,null,null," ",null,null,0]
[null,null,null,null," ",null,null,0]
[null,null,null,null," ",null,null,0]
[null,null,null,null," ",null,null,0]
[null,null,null,null," ",null,null,0]
[null,null,null,null," ",null,null,0]
[null,null,null,null," ",null,null,0]
[null,null,null,null," ",null,null,0]
[null,null,null,null," ",null,null,0]
[null,null,null,null," ",null,null,0]
[null,null,null,null," ",null,null,0]
[null,null,null,null," ",null,null,0]
[null,null,null,null," ",null,null,0]
[null,null,null,null," ",null,null,0]
[null,null,null,null," ",null,null,0]
[null,null,null,null," ",null,null,0]
[null,null,null,null," ",null,null,0]
[null,null,null,null," ",null,null,0]
[null,null,null,null," ",null,null,0]
[null,null,null,null," ",null,null,0]
[null,null,null,null," ",null,null,0]
[null,null,null,null," ",null,null,0]
[null,null,null,null," ",null,null,0]
[null,null,null,null," ",null,null,0]
[null,null,null,null,{"$f":"IF(D3785>0,VLOOKUP(D3785,entidades,2,FALSE),\" \")","v":" "},null,null,{"$f":"+F3785+G3785","v":0}]
[null,null,null,null," ",null,null,0]
[null,null,null,null," ",null,null,0]
[null,null,null,null," ",null,null,0]
[null,null,null,null," ",null,null,0]
[null,null,null,null," ",null,null,0]
[null,null,null,null," ",null,null,0]
[null,null,null,null," ",null,null,0]
[null,null,null,null," ",null,null,0]
[null,null,null,null," ",null,null,0]
[null,null,null,null," ",null,null,0]
[null,null,null,null," ",null,null,0]
[null,null,null,null," ",null,null,0]
[null,null,null,null," ",null,null,0]
[null,null,null,null," ",null,null,0]
[null,null,null,null," ",null,null,0]
[null,null,null,null," ",null,null,0]
[null,null,null,null," ",null,null,0]
[null,null,null,null," ",null,null,0]
[null,null,null,null," ",null,null,0]
[null,null,null,null," ",null,null,0]
[null,null,null,null," ",null,null,0]
[null,null,null,null," ",null,null,0]
[null,null,null,null," ",null,null,0]
[null,null,null,null," ",null,null,0]
[null,null,null,null," ",null,null,0]
[null,null,null,null," ",null,null,0]
[null,null,null,null," ",null,null,0]
[null,null,null,null," ",null,null,0]
[null,null,null,null," ",null,null,0]
[null,null,null,null," ",null,null,0]
[null,null,null,null," ",null,null,0]
[null,null,null,null," ",null,null,0]
[null,null,null,null," ",null,null,0]
[null,null,null,null," ",null,null,0]
[null,null,null,null," ",null,null,0]
[null,null,null,null," ",null,null,0]
[null,null,null,null," ",null,null,0]
[null,null,null,null," ",null,null,0]
[null,null,null,null," ",null,null,0]
[null,null,null,null," ",null,null,0]
[null,null,null,null," ",null,null,0]
[null,null,null,null," ",null,null,0]
[null,null,null,null," ",null,null,0]
[null,null,null,null," ",null,null,0]
[null,null,null,null," ",null,null,0]
[null,null,null,null," ",null,null,0]
[null,null,null,null," ",null,null,0]
[null,null,null,null," ",null,null,0]
[null,null,null,null," ",null,null,0]
[null,null,null,null," ",null,null,0]
[null,null,null,null," ",null,null,0]
[null,null,null,null," ",null,null,0]
[null,null,null,null," ",null,null,0]
[null,null,null,null," ",null,null,0]
[null,null,null,null," ",null,null,0]
[null,null,null,null," ",null,null,0]
[null,null,null,null," ",null,null,0]
[null,null,null,null," ",null,null,0]
[null,null,null,null," ",null,null,0]
[null,null,null,null," ",null,null,0]
[null,null,null,null," ",null,null,0]
[null,null,null,null," ",null,null,0]
[null,null,null,null," ",null,null,0]
[null,null,null,null,{"$f":"IF(D3849>0,VLOOKUP(D3849,entidades,2,FALSE),\" \")","v":" "},null,null,{"$f":"+F3849+G3849","v":0}]
[null,null,null,null," ",null,null,0]
[null,null,null,null," ",null,null,0]
[null,null,null,null," ",null,null,0]
[null,null,null,null," ",null,null,0]
[null,null,null,null," ",null,null,0]
[null,null,null,null," ",null,null,0]
[null,null,null,null," ",null,null,0]
[null,null,null,null," ",null,null,0]
[null,null,null,null," ",null,null,0]
[null,null,null,null," ",null,null,0]
[null,null,null,null," ",null,null,0]
[null,null,null,null," ",null,null,0]
[null,null,null,null," ",null,null,0]
[null,null,null,null," ",null,null,0]
[null,null,null,null," ",null,null,0]
[null,null,null,null," ",null,null,0]
[null,null,null,null," ",null,null,0]
[null,null,null,null," ",null,null,0]
[null,null,null,null," ",null,null,0]
[null,null,null,null," ",null,null,0]
[null,null,null,null," ",null,null,0]
[null,null,null,null," ",null,null,0]
[null,null,null,null," ",null,null,0]
[null,null,null,null," ",null,null,0]
[null,null,null,null," ",null,null,0]
[null,null,null,null," ",null,null,0]
[null,null,null,null," ",null,null,0]
[null,null,null,null," ",null,null,0]
[null,null,null,null," ",null,null,0]
[null,null,null,null," ",null,null,0]
[null,null,null,null," ",null,null,0]
[null,null,null,null," ",null,null,0]
[null,null,null,null," ",null,null,0]
[null,null,null,null," ",null,null,0]
[null,null,null,null," ",null,null,0]
[null,null,null,null," ",null,null,0]
[null,null,null,null," ",null,null,0]
[null,null,null,null," ",null,null,0]
[null,null,null,null," ",null,null,0]
[null,null,null,null," ",null,null,0]
[null,null,null,null," ",null,null,0]
[null,null,null,null," ",null,null,0]
[null,null,null,null," ",null,null,0]
[null,null,null,null," ",null,null,0]
[null,null,null,null," ",null,null,0]
[null,null,null,null," ",null,null,0]
[null,null,null,null," ",null,null,0]
[null,null,null,null," ",null,null,0]
[null,null,null,null," ",null,null,0]
[null,null,null,null," ",null,null,0]
[null,null,null,null," ",null,null,0]
[null,null,null,null," ",null,null,0]
[null,null,null,null," ",null,null,0]
[null,null,null,null," ",null,null,0]
[null,null,null,null," ",null,null,0]
[null,null,null,null," ",null,null,0]
[null,null,null,null," ",null,null,0]
[null,null,null,null," ",null,null,0]
[null,null,null,null," ",null,null,0]
[null,null,null,null," ",null,null,0]
[null,null,null,null," ",null,null,0]
[null,null,null,null," ",null,null,0]
[null,null,null,null," ",null,null,0]
[null,null,null,null,{"$f":"IF(D3913>0,VLOOKUP(D3913,entidades,2,FALSE),\" \")","v":" "},null,null,{"$f":"+F3913+G3913","v":0}]
[null,null,null,null," ",null,null,0]
[null,null,null,null," ",null,null,0]
[null,null,null,null," ",null,null,0]
[null,null,null,null," ",null,null,0]
[null,null,null,null," ",null,null,0]
[null,null,null,null," ",null,null,0]
[null,null,null,null," ",null,null,0]
[null,null,null,null," ",null,null,0]
[null,null,null,null," ",null,null,0]
[null,null,null,null," ",null,null,0]
[null,null,null,null," ",null,null,0]
[null,null,null,null," ",null,null,0]
[null,null,null,null," ",null,null,0]
[null,null,null,null," ",null,null,0]
[null,null,null,null," ",null,null,0]
[null,null,null,null," ",null,null,0]
[null,null,null,null," ",null,null,0]
[null,null,null,null," ",null,null,0]
[null,null,null,null," ",null,null,0]
[null,null,null,null," ",null,null,0]
[null,null,null,null," ",null,null,0]
[null,null,null,null," ",null,null,0]
[null,null,null,null," ",null,null,0]
[null,null,null,null," ",null,null,0]
[null,null,null,null," ",null,null,0]
[null,null,null,null," ",null,null,0]
[null,null,null,null," ",null,null,0]
[null,null,null,null," ",null,null,0]
[null,null,null,null," ",null,null,0]
[null,null,null,null," ",null,null,0]
[null,null,null,null," ",null,null,0]
[null,null,null,null," ",null,null,0]
[null,null,null,null," ",null,null,0]
[null,null,null,null," ",null,null,0]
[null,null,null,null," ",null,null,0]
[null,null,null,null," ",null,null,0]
[null,null,null,null," ",null,null,0]
[null,null,null,null," ",null,null,0]
[null,null,null,null," ",null,null,0]
[null,null,null,null," ",null,null,0]
[null,null,null,null," ",null,null,0]
[null,null,null,null," ",null,null,0]
[null,null,null,null," ",null,null,0]
[null,null,null,null," ",null,null,0]
[null,null,null,null," ",null,null,0]
[null,null,null,null," ",null,null,0]
[null,null,null,null," ",null,null,0]
[null,null,null,null," ",null,null,0]
[null,null,null,null," ",null,null,0]
[null,null,null,null," ",null,null,0]
[null,null,null,null," ",null,null,0]
[null,null,null,null," ",null,null,0]
[null,null,null,null," ",null,null,0]
[null,null,null,null," ",null,null,0]
[null,null,null,null," ",null,null,0]
[null,null,null,null," ",null,null,0]
[null,null,null,null," ",null,null,0]
[null,null,null,null," ",null,null,0]
[null,null,null,null," ",null,null,0]
[null,null,null,null," ",null,null,0]
[null,null,null,null," ",null,null,0]
[null,null,null,null," ",null,null,0]
[null,null,null,null," ",null,null,0]
[null,null,null,null,{"$f":"IF(D3977>0,VLOOKUP(D3977,entidades,2,FALSE),\" \")","v":" "},null,null,{"$f":"+F3977+G3977","v":0}]
[null,null,null,null," ",null,null,0]
[null,null,null,null," ",null,null,0]
[null,null,null,null," ",null,null,0]
[null,null,null,null," ",null,null,0]
[null,null,null,null," ",null,null,0]
[null,null,null,null," ",null,null,0]
[null,null,null,null," ",null,null,0]
[null,null,null,null," ",null,null,0]
[null,null,null,null," ",null,null,0]
[null,null,null,null," ",null,null,0]
[null,null,null,null," ",null,null,0]
[null,null,null,null," ",null,null,0]
[null,null,null,null," ",null,null,0]
[null,null,null,null," ",null,null,0]
[null,null,null,null," ",null,null,0]
[null,null,null,null," ",null,null,0]
[null,null,null,null," ",null,null,0]
[null,null,null,null," ",null,null,0]
[null,null,null,null," ",null,null,0]
[null,null,null,null," ",null,null,0]
[null,null,null,null," ",null,null,0]
[null,null,null,null," ",null,null,0]
[null,null,null,null," ",null,null,0]
[null,null,null,null," ",null,null,0]
[null,null,null,null," ",null,null,0]
[null,null,null,null," ",null,null,0]
[null,null,null,null," ",null,null,0]
[null,null,null,null," ",null,null,0]
[null,null,null,null," ",null,null,0]
[null,null,null,null," ",null,null,0]
[null,null,null,null," ",null,null,0]
[null,null,null,null," ",null,null,0]
[null,null,null,null," ",null,null,0]
[null,null,null,null," ",null,null,0]
[null,null,null,null," ",null,null,0]
[null,null,null,null," ",null,null,0]
[null,null,null,null," ",null,null,0]
[null,null,null,null," ",null,null,0]
[null,null,null,null," ",null,null,0]
[null,null,null,null," ",null,null,0]
[null,null,null,null," ",null,null,0]
[null,null,null,null," ",null,null,0]
[null,null,null,null," ",null,null,0]
[null,null,null,null," ",null,null,0]
[null,null,null,null," ",null,null,0]
[null,null,null,null," ",null,null,0]
[null,null,null,null," ",null,null,0]
[null,null,null,null," ",null,null,0]
[null,null,null,null," ",null,null,0]
[null,null,null,null," ",null,null,0]
[null,null,null,null," ",null,null,0]
[null,null,null,null," ",null,null,0]
[null,null,null,null," ",null,null,0]
[null,null,null,null," ",null,null,0]
[null,null,null,null," ",null,null,0]
[null,null,null,null," ",null,null,0]
[null,null,null,null," ",null,null,0]
[null,null,null,null," ",null,null,0]
[null,null,null,null," ",null,null,0]
[null,null,null,null," ",null,null,0]
[null,null,null,null," ",null,null,0]
[null,null,null,null," ",null,null,0]
[null,null,null,null," ",null,null,0]
[null,null,null,null,{"$f":"IF(D4041>0,VLOOKUP(D4041,entidades,2,FALSE),\" \")","v":" "},null,null,{"$f":"+F4041+G4041","v":0}]
[null,null,null,null," ",null,null,0]
[null,null,null,null," ",null,null,0]
[null,null,null,null," ",null,null,0]
[null,null,null,null," ",null,null,0]
[null,null,null,null," ",null,null,0]
[null,null,null,null," ",null,null,0]
[null,null,null,null," ",null,null,0]
[null,null,null,null," ",null,null,0]
[null,null,null,null," ",null,null,0]
[null,null,null,null," ",null,null,0]
[null,null,null,null," ",null,null,0]
[null,null,null,null," ",null,null,0]
[null,null,null,null," ",null,null,0]
[null,null,null,null," ",null,null,0]
[null,null,null,null," ",null,null,0]
[null,null,null,null," ",null,null,0]
[null,null,null,null," ",null,null,0]
[null,null,null,null," ",null,null,0]
[null,null,null,null," ",null,null,0]
[null,null,null,null," ",null,null,0]
[null,null,null,null," ",null,null,0]
[null,null,null,null," ",null,null,0]
[null,null,null,null," ",null,null,0]
[null,null,null,null," ",null,null,0]
[null,null,null,null," ",null,null,0]
[null,null,null,null," ",null,null,0]
[null,null,null,null," ",null,null,0]
[null,null,null,null," ",null,null,0]
[null,null,null,null," ",null,null,0]
[null,null,null,null," ",null,null,0]
[null,null,null,null," ",null,null,0]
[null,null,null,null," ",null,null,0]
[null,null,null,null," ",null,null,0]
[null,null,null,null," ",null,null,0]
[null,null,null,null," ",null,null,0]
[null,null,null,null," ",null,null,0]
[null,null,null,null," ",null,null,0]
[null,null,null,null," ",null,null,0]
[null,null,null,null," ",null,null,0]
[null,null,null,null," ",null,null,0]
[null,null,null,null," ",null,null,0]
[null,null,null,null," ",null,null,0]
[null,null,null,null," ",null,null,0]
[null,null,null,null," ",null,null,0]
[null,null,null,null," ",null,null,0]
[null,null,null,null," ",null,null,0]
[null,null,null,null," ",null,null,0]
[null,null,null,null," ",null,null,0]
[null,null,null,null," ",null,null,0]
[null,null,null,null," ",null,null,0]
[null,null,null,null," ",null,null,0]
[null,null,null,null," ",null,null,0]
[null,null,null,null," ",null,null,0]
[null,null,null,null," ",null,null,0]
[null,null,null,null," ",null,null,0]
[null,null,null,null," ",null,null,0]
[null,null,null,null," ",null,null,0]
[null,null,null,null," ",null,null,0]
[null,null,null,null," ",null,null,0]
[null,null,null,null," ",null,null,0]
[null,null,null,null," ",null,null,0]
[null,null,null,null," ",null,null,0]
[null,null,null,null," ",null,null,0]
[null,null,null,null,{"$f":"IF(D4105>0,VLOOKUP(D4105,entidades,2,FALSE),\" \")","v":" "},null,null,{"$f":"+F4105+G4105","v":0}]
[null,null,null,null," ",null,null,0]
[null,null,null,null," ",null,null,0]
[null,null,null,null," ",null,null,0]
[null,null,null,null," ",null,null,0]
[null,null,null,null," ",null,null,0]
[null,null,null,null," ",null,null,0]
[null,null,null,null," ",null,null,0]
[null,null,null,null," ",null,null,0]
[null,null,null,null," ",null,null,0]
[null,null,null,null," ",null,null,0]
[null,null,null,null," ",null,null,0]
[null,null,null,null," ",null,null,0]
[null,null,null,null," ",null,null,0]
[null,null,null,null," ",null,null,0]
[null,null,null,null," ",null,null,0]
[null,null,null,null," ",null,null,0]
[null,null,null,null," ",null,null,0]
[null,null,null,null," ",null,null,0]
[null,null,null,null," ",null,null,0]
[null,null,null,null," ",null,null,0]
[null,null,null,null," ",null,null,0]
[null,null,null,null," ",null,null,0]
[null,null,null,null," ",null,null,0]
[null,null,null,null," ",null,null,0]
[null,null,null,null," ",null,null,0]
[null,null,null,null," ",null,null,0]
[null,null,null,null," ",null,null,0]
[null,null,null,null," ",null,null,0]
[null,null,null,null," ",null,null,0]
[null,null,null,null," ",null,null,0]
[null,null,null,null," ",null,null,0]
[null,null,null,null," ",null,null,0]
[null,null,null,null," ",null,null,0]
[null,null,null,null," ",null,null,0]
[null,null,null,null," ",null,null,0]
[null,null,null,null," ",null,null,0]
[null,null,null,null," ",null,null,0]
[null,null,null,null," ",null,null,0]
[null,null,null,null," ",null,null,0]
[null,null,null,null," ",null,null,0]
[null,null,null,null," ",null,null,0]
[null,null,null,null," ",null,null,0]
[null,null,null,null," ",null,null,0]
[null,null,null,null," ",null,null,0]
[null,null,null,null," ",null,null,0]
[null,null,null,null," ",null,null,0]
[null,null,null,null," ",null,null,0]
[null,null,null,null," ",null,null,0]
[null,null,null,null," ",null,null,0]
[null,null,null,null," ",null,null,0]
[null,null,null,null," ",null,null,0]
[null,null,null,null," ",null,null,0]
[null,null,null,null," ",null,null,0]
[null,null,null,null," ",null,null,0]
[null,null,null,null," ",null,null,0]
[null,null,null,null," ",null,null,0]
[null,null,null,null," ",null,null,0]
[null,null,null,null," ",null,null,0]
[null,null,null,null," ",null,null,0]
[null,null,null,null," ",null,null,0]
[null,null,null,null," ",null,null,0]
[null,null,null,null," ",null,null,0]
[null,null,null,null," ",null,null,0]
[null,null,null,null,{"$f":"IF(D4169>0,VLOOKUP(D4169,entidades,2,FALSE),\" \")","v":" "},null,null,{"$f":"+F4169+G4169","v":0}]
[null,null,null,null," ",null,null,0]
[null,null,null,null," ",null,null,0]
[null,null,null,null," ",null,null,0]
[null,null,null,null," ",null,null,0]
[null,null,null,null," ",null,null,0]
[null,null,null,null," ",null,null,0]
[null,null,null,null," ",null,null,0]
[null,null,null,null," ",null,null,0]
[null,null,null,null," ",null,null,0]
[null,null,null,null," ",null,null,0]
[null,null,null,null," ",null,null,0]
[null,null,null,null," ",null,null,0]
[null,null,null,null," ",null,null,0]
[null,null,null,null," ",null,null,0]
[null,null,null,null," ",null,null,0]
[null,null,null,null," ",null,null,0]
[null,null,null,null," ",null,null,0]
[null,null,null,null," ",null,null,0]
[null,null,null,null," ",null,null,0]
[null,null,null,null," ",null,null,0]
[null,null,null,null," ",null,null,0]
[null,null,null,null," ",null,null,0]
[null,null,null,null," ",null,null,0]
[null,null,null,null," ",null,null,0]
[null,null,null,null," ",null,null,0]
[null,null,null,null," ",null,null,0]
[null,null,null,null," ",null,null,0]
[null,null,null,null," ",null,null,0]
[null,null,null,null," ",null,null,0]
[null,null,null,null," ",null,null,0]
[null,null,null,null," ",null,null,0]
[null,null,null,null," ",null,null,0]
[null,null,null,null," ",null,null,0]
[null,null,null,null," ",null,null,0]
[null,null,null,null," ",null,null,0]
[null,null,null,null," ",null,null,0]
[null,null,null,null," ",null,null,0]
[null,null,null,null," ",null,null,0]
[null,null,null,null," ",null,null,0]
[null,null,null,null," ",null,null,0]
[null,null,null,null," ",null,null,0]
[null,null,null,null," ",null,null,0]
[null,null,null,null," ",null,null,0]
[null,null,null,null," ",null,null,0]
[null,null,null,null," ",null,null,0]
[null,null,null,null," ",null,null,0]
[null,null,null,null," ",null,null,0]
[null,null,null,null," ",null,null,0]
[null,null,null,null," ",null,null,0]
[null,null,null,null," ",null,null,0]
[null,null,null,null," ",null,null,0]
[null,null,null,null," ",null,null,0]
[null,null,null,null," ",null,null,0]
[null,null,null,null," ",null,null,0]
[null,null,null,null," ",null,null,0]
[null,null,null,null," ",null,null,0]
[null,null,null,null," ",null,null,0]
[null,null,null,null," ",null,null,0]
[null,null,null,null," ",null,null,0]
[null,null,null,null," ",null,null,0]
[null,null,null,null," ",null,null,0]
[null,null,null,null," ",null,null,0]
[null,null,null,null," ",null,null,0]
[null,null,null,null,{"$f":"IF(D4233>0,VLOOKUP(D4233,entidades,2,FALSE),\" \")","v":" "},null,null,{"$f":"+F4233+G4233","v":0}]
[null,null,null,null," ",null,null,0]
[null,null,null,null," ",null,null,0]
[null,null,null,null," ",null,null,0]
[null,null,null,null," ",null,null,0]
[null,null,null,null," ",null,null,0]
[null,null,null,null," ",null,null,0]
[null,null,null,null," ",null,null,0]
[null,null,null,null," ",null,null,0]
[null,null,null,null," ",null,null,0]
[null,null,null,null," ",null,null,0]
[null,null,null,null," ",null,null,0]
[null,null,null,null," ",null,null,0]
[null,null,null,null," ",null,null,0]
[null,null,null,null," ",null,null,0]
[null,null,null,null," ",null,null,0]
[null,null,null,null," ",null,null,0]
[null,null,null,null," ",null,null,0]
[null,null,null,null," ",null,null,0]
[null,null,null,null," ",null,null,0]
[null,null,null,null," ",null,null,0]
[null,null,null,null," ",null,null,0]
[null,null,null,null," ",null,null,0]
[null,null,null,null," ",null,null,0]
[null,null,null,null," ",null,null,0]
[null,null,null,null," ",null,null,0]
[null,null,null,null," ",null,null,0]
[null,null,null,null," ",null,null,0]
[null,null,null,null," ",null,null,0]
[null,null,null,null," ",null,null,0]
[null,null,null,null," ",null,null,0]
[null,null,null,null," ",null,null,0]
[null,null,null,null," ",null,null,0]
[null,null,null,null," ",null,null,0]
[null,null,null,null," ",null,null,0]
[null,null,null,null," ",null,null,0]
[null,null,null,null," ",null,null,0]
[null,null,null,null," ",null,null,0]
[null,null,null,null," ",null,null,0]
[null,null,null,null," ",null,null,0]
[null,null,null,null," ",null,null,0]
[null,null,null,null," ",null,null,0]
[null,null,null,null," ",null,null,0]
[null,null,null,null," ",null,null,0]
[null,null,null,null," ",null,null,0]
[null,null,null,null," ",null,null,0]
[null,null,null,null," ",null,null,0]
[null,null,null,null," ",null,null,0]
[null,null,null,null," ",null,null,0]
[null,null,null,null," ",null,null,0]
[null,null,null,null," ",null,null,0]
[null,null,null,null," ",null,null,0]
[null,null,null,null," ",null,null,0]
[null,null,null,null," ",null,null,0]
[null,null,null,null," ",null,null,0]
[null,null,null,null," ",null,null,0]
[null,null,null,null," ",null,null,0]
[null,null,null,null," ",null,null,0]
[null,null,null,null," ",null,null,0]
[null,null,null,null," ",null,null,0]
[null,null,null,null," ",null,null,0]
[null,null,null,null," ",null,null,0]
[null,null,null,null," ",null,null,0]
[null,null,null,null," ",null,null,0]
[null,null,null,null,{"$f":"IF(D4297>0,VLOOKUP(D4297,entidades,2,FALSE),\" \")","v":" "},null,null,{"$f":"+F4297+G4297","v":0}]
[null,null,null,null," ",null,null,0]
[null,null,null,null," ",null,null,0]
[null,null,null,null," ",null,null,0]
[null,null,null,null," ",null,null,0]
[null,null,null,null," ",null,null,0]
[null,null,null,null," ",null,null,0]
[null,null,null,null," ",null,null,0]
[null,null,null,null," ",null,null,0]
[null,null,null,null," ",null,null,0]
[null,null,null,null," ",null,null,0]
[null,null,null,null," ",null,null,0]
[null,null,null,null," ",null,null,0]
[null,null,null,null," ",null,null,0]
[null,null,null,null," ",null,null,0]
[null,null,null,null," ",null,null,0]
[null,null,null,null," ",null,null,0]
[null,null,null,null," ",null,null,0]
[null,null,null,null," ",null,null,0]
[null,null,null,null," ",null,null,0]
[null,null,null,null," ",null,null,0]
[null,null,null,null," ",null,null,0]
[null,null,null,null," ",null,null,0]
[null,null,null,null," ",null,null,0]
[null,null,null,null," ",null,null,0]
[null,null,null,null," ",null,null,0]
[null,null,null,null," ",null,null,0]
[null,null,null,null," ",null,null,0]
[null,null,null,null," ",null,null,0]
[null,null,null,null," ",null,null,0]
[null,null,null,null," ",null,null,0]
[null,null,null,null," ",null,null,0]
[null,null,null,null," ",null,null,0]
[null,null,null,null," ",null,null,0]
[null,null,null,null," ",null,null,0]
[null,null,null,null," ",null,null,0]
[null,null,null,null," ",null,null,0]
[null,null,null,null," ",null,null,0]
[null,null,null,null," ",null,null,0]
[null,null,null,null," ",null,null,0]
[null,null,null,null," ",null,null,0]
[null,null,null,null," ",null,null,0]
[null,null,null,null," ",null,null,0]
[null,null,null,null," ",null,null,0]
[null,null,null,null," ",null,null,0]
[null,null,null,null," ",null,null,0]
[null,null,null,null," ",null,null,0]
[null,null,null,null," ",null,null,0]
[null,null,null,null," ",null,null,0]
[null,null,null,null," ",null,null,0]
[null,null,null,null," ",null,null,0]
[null,null,null,null," ",null,null,0]
[null,null,null,null," ",null,null,0]
[null,null,null,null," ",null,null,0]
[null,null,null,null," ",null,null,0]
[null,null,null,null," ",null,null,0]
[null,null,null,null," ",null,null,0]
[null,null,null,null," ",null,null,0]
[null,null,null,null," ",null,null,0]
[null,null,null,null," ",null,null,0]
[null,null,null,null," ",null,null,0]
[null,null,null,null," ",null,null,0]
[null,null,null,null," ",null,null,0]
[null,null,null,null," ",null,null,0]
[null,null,null,null,{"$f":"IF(D4361>0,VLOOKUP(D4361,entidades,2,FALSE),\" \")","v":" "},null,null,{"$f":"+F4361+G4361","v":0}]
[null,null,null,null," ",null,null,0]
[null,null,null,null," ",null,null,0]
[null,null,null,null," ",null,null,0]
[null,null,null,null," ",null,null,0]
[null,null,null,null," ",null,null,0]
[null,null,null,null," ",null,null,0]
[null,null,null,null," ",null,null,0]
[null,null,null,null," ",null,null,0]
[null,null,null,null," ",null,null,0]
[null,null,null,null," ",null,null,0]
[null,null,null,null," ",null,null,0]
[null,null,null,null," ",null,null,0]
[null,null,null,null," ",null,null,0]
[null,null,null,null," ",null,null,0]
[null,null,null,null," ",null,null,0]
[null,null,null,null," ",null,null,0]
[null,null,null,null," ",null,null,0]
[null,null,null,null," ",null,null,0]
[null,null,null,null," ",null,null,0]
[null,null,null,null," ",null,null,0]
[null,null,null,null," ",null,null,0]
[null,null,null,null," ",null,null,0]
[null,null,null,null," ",null,null,0]
[null,null,null,null," ",null,null,0]
[null,null,null,null," ",null,null,0]
[null,null,null,null," ",null,null,0]
[null,null,null,null," ",null,null,0]
[null,null,null,null," ",null,null,0]
[null,null,null,null," ",null,null,0]
[null,null,null,null," ",null,null,0]
[null,null,null,null," ",null,null,0]
[null,null,null,null," ",null,null,0]
[null,null,null,null," ",null,null,0]
[null,null,null,null," ",null,null,0]
[null,null,null,null," ",null,null,0]
[null,null,null,null," ",null,null,0]
[null,null,null,null," ",null,null,0]
[null,null,null,null," ",null,null,0]
[null,null,null,null," ",null,null,0]
[null,null,null,null," ",null,null,0]
[null,null,null,null," ",null,null,0]
[null,null,null,null," ",null,null,0]
[null,null,null,null," ",null,null,0]
[null,null,null,null," ",null,null,0]
[null,null,null,null," ",null,null,0]
[null,null,null,null," ",null,null,0]
[null,null,null,null," ",null,null,0]
[null,null,null,null," ",null,null,0]
[null,null,null,null," ",null,null,0]
[null,null,null,null," ",null,null,0]
[null,null,null,null," ",null,null,0]
[null,null,null,null," ",null,null,0]
[null,null,null,null," ",null,null,0]
[null,null,null,null," ",null,null,0]
[null,null,null,null," ",null,null,0]
[null,null,null,null," ",null,null,0]
[null,null,null,null," ",null,null,0]
[null,null,null,null," ",null,null,0]
[null,null,null,null," ",null,null,0]
[null,null,null,null," ",null,null,0]
[null,null,null,null," ",null,null,0]
[null,null,null,null," ",null,null,0]
[null,null,null,null," ",null,null,0]
[null,null,null,null,{"$f":"IF(D4425>0,VLOOKUP(D4425,entidades,2,FALSE),\" \")","v":" "},null,null,{"$f":"+F4425+G4425","v":0}]
[null,null,null,null," ",null,null,0]
[null,null,null,null," ",null,null,0]
[null,null,null,null," ",null,null,0]
[null,null,null,null," ",null,null,0]
[null,null,null,null," ",null,null,0]
[null,null,null,null," ",null,null,0]
[null,null,null,null," ",null,null,0]
[null,null,null,null," ",null,null,0]
[null,null,null,null," ",null,null,0]
[null,null,null,null," ",null,null,0]
[null,null,null,null," ",null,null,0]
[null,null,null,null," ",null,null,0]
[null,null,null,null," ",null,null,0]
[null,null,null,null," ",null,null,0]
[null,null,null,null," ",null,null,0]
[null,null,null,null," ",null,null,0]
[null,null,null,null," ",null,null,0]
[null,null,null,null," ",null,null,0]
[null,null,null,null," ",null,null,0]
[null,null,null,null," ",null,null,0]
[null,null,null,null," ",null,null,0]
[null,null,null,null," ",null,null,0]
[null,null,null,null," ",null,null,0]
[null,null,null,null," ",null,null,0]
[null,null,null,null," ",null,null,0]
[null,null,null,null," ",null,null,0]
[null,null,null,null," ",null,null,0]
[null,null,null,null," ",null,null,0]
[null,null,null,null," ",null,null,0]
[null,null,null,null," ",null,null,0]
[null,null,null,null," ",null,null,0]
[null,null,null,null," ",null,null,0]
[null,null,null,null," ",null,null,0]
[null,null,null,null," ",null,null,0]
[null,null,null,null," ",null,null,0]
[null,null,null,null," ",null,null,0]
[null,null,null,null," ",null,null,0]
[null,null,null,null," ",null,null,0]
[null,null,null,null," ",null,null,0]
[null,null,null,null," ",null,null,0]
[null,null,null,null," ",null,null,0]
[null,null,null,null," ",null,null,0]
[null,null,null,null," ",null,null,0]
[null,null,null,null," ",null,null,0]
[null,null,null,null," ",null,null,0]
[null,null,null,null," ",null,null,0]
[null,null,null,null," ",null,null,0]
[null,null,null,null," ",null,null,0]
[null,null,null,null," ",null,null,0]
[null,null,null,null," ",null,null,0]
[null,null,null,null," ",null,null,0]
[null,null,null,null," ",null,null,0]
[null,null,null,null," ",null,null,0]
[null,null,null,null," ",null,null,0]
[null,null,null,null," ",null,null,0]
[null,null,null,null," ",null,null,0]
[null,null,null,null," ",null,null,0]
[null,null,null,null," ",null,null,0]
[null,null,null,null," ",null,null,0]
[null,null,null,null," ",null,null,0]
[null,null,null,null," ",null,null,0]
[null,null,null,null," ",null,null,0]
[null,null,null,null," ",null,null,0]
[null,null,null,null,{"$f":"IF(D4489>0,VLOOKUP(D4489,entidades,2,FALSE),\" \")","v":" "},null,null,{"$f":"+F4489+G4489","v":0}]
[null,null,null,null," ",null,null,0]
[null,null,null,null," ",null,null,0]
[null,null,null,null," ",null,null,0]
[null,null,null,null," ",null,null,0]
[null,null,null,null," ",null,null,0]
[null,null,null,null," ",null,null,0]
[null,null,null,null," ",null,null,0]
[null,null,null,null," ",null,null,0]
[null,null,null,null," ",null,null,0]
[null,null,null,null," ",null,null,0]
[null,null,null,null," ",null,null,0]
[null,null,null,null," ",null,null,0]
[null,null,null,null," ",null,null,0]
[null,null,null,null," ",null,null,0]
[null,null,null,null," ",null,null,0]
[null,null,null,null," ",null,null,0]
[null,null,null,null," ",null,null,0]
[null,null,null,null," ",null,null,0]
[null,null,null,null," ",null,null,0]
[null,null,null,null," ",null,null,0]
[null,null,null,null," ",null,null,0]
[null,null,null,null," ",null,null,0]
[null,null,null,null," ",null,null,0]
[null,null,null,null," ",null,null,0]
[null,null,null,null," ",null,null,0]
[null,null,null,null," ",null,null,0]
[null,null,null,null," ",null,null,0]
[null,null,null,null," ",null,null,0]
[null,null,null,null," ",null,null,0]
[null,null,null,null," ",null,null,0]
[null,null,null,null," ",null,null,0]
[null,null,null,null," ",null,null,0]
[null,null,null,null," ",null,null,0]
[null,null,null,null," ",null,null,0]
[null,null,null,null," ",null,null,0]
[null,null,null,null," ",null,null,0]
[null,null,null,null," ",null,null,0]
[null,null,null,null," ",null,null,0]
[null,null,null,null," ",null,null,0]
[null,null,null,null," ",null,null,0]
[null,null,null,null," ",null,null,0]
[null,null,null,null," ",null,null,0]
[null,null,null,null," ",null,null,0]
[null,null,null,null," ",null,null,0]
[null,null,null,null," ",null,null,0]
[null,null,null,null," ",null,null,0]
[null,null,null,null," ",null,null,0]
[null,null,null,null," ",null,null,0]
[null,null,null,null," ",null,null,0]
[null,null,null,null," ",null,null,0]
[null,null,null,null," ",null,null,0]
[null,null,null,null," ",null,null,0]
[null,null,null,null," ",null,null,0]
[null,null,null,null," ",null,null,0]
[null,null,null,null," ",null,null,0]
[null,null,null,null," ",null,null,0]
[null,null,null,null," ",null,null,0]
[null,null,null,null," ",null,null,0]
[null,null,null,null," ",null,null,0]
[null,null,null,null," ",null,null,0]
[null,null,null,null," ",null,null,0]
[null,null,null,null," ",null,null,0]
[null,null,null,null," ",null,null,0]
[null,null,null,null,{"$f":"IF(D4553>0,VLOOKUP(D4553,entidades,2,FALSE),\" \")","v":" "},null,null,{"$f":"+F4553+G4553","v":0}]
[null,null,null,null," ",null,null,0]
[null,null,null,null," ",null,null,0]
[null,null,null,null," ",null,null,0]
[null,null,null,null," ",null,null,0]
[null,null,null,null," ",null,null,0]
[null,null,null,null," ",null,null,0]
[null,null,null,null," ",null,null,0]
[null,null,null,null," ",null,null,0]
[null,null,null,null," ",null,null,0]
[null,null,null,null," ",null,null,0]
[null,null,null,null," ",null,null,0]
[null,null,null,null," ",null,null,0]
[null,null,null,null," ",null,null,0]
[null,null,null,null," ",null,null,0]
[null,null,null,null," ",null,null,0]
[null,null,null,null," ",null,null,0]
[null,null,null,null," ",null,null,0]
[null,null,null,null," ",null,null,0]
[null,null,null,null," ",null,null,0]
[null,null,null,null," ",null,null,0]
[null,null,null,null," ",null,null,0]
[null,null,null,null," ",null,null,0]
[null,null,null,null," ",null,null,0]
[null,null,null,null," ",null,null,0]
[null,null,null,null," ",null,null,0]
[null,null,null,null," ",null,null,0]
[null,null,null,null," ",null,null,0]
[null,null,null,null," ",null,null,0]
[null,null,null,null," ",null,null,0]
[null,null,null,null," ",null,null,0]
[null,null,null,null," ",null,null,0]
[null,null,null,null," ",null,null,0]
[null,null,null,null," ",null,null,0]
[null,null,null,null," ",null,null,0]
[null,null,null,null," ",null,null,0]
[null,null,null,null," ",null,null,0]
[null,null,null,null," ",null,null,0]
[null,null,null,null," ",null,null,0]
[null,null,null,null," ",null,null,0]
[null,null,null,null," ",null,null,0]
[null,null,null,null," ",null,null,0]
[null,null,null,null," ",null,null,0]
[null,null,null,null," ",null,null,0]
[null,null,null,null," ",null,null,0]
[null,null,null,null," ",null,null,0]
[null,null,null,null," ",null,null,0]
[null,null,null,null," ",null,null,0]
[null,null,null,null," ",null,null,0]
[null,null,null,null," ",null,null,0]
[null,null,null,null," ",null,null,0]
[null,null,null,null," ",null,null,0]
[null,null,null,null," ",null,null,0]
[null,null,null,null," ",null,null,0]
[null,null,null,null," ",null,null,0]
[null,null,null,null," ",null,null,0]
[null,null,null,null," ",null,null,0]
[null,null,null,null," ",null,null,0]
[null,null,null,null," ",null,null,0]
[null,null,null,null," ",null,null,0]
[null,null,null,null," ",null,null,0]
[null,null,null,null," ",null,null,0]
[null,null,null,null," ",null,null,0]
[null,null,null,null," ",null,null,0]
[null,null,null,null,{"$f":"IF(D4617>0,VLOOKUP(D4617,entidades,2,FALSE),\" \")","v":" "},null,null,{"$f":"+F4617+G4617","v":0}]
[null,null,null,null," ",null,null,0]
[null,null,null,null," ",null,null,0]
[null,null,null,null," ",null,null,0]
[null,null,null,null," ",null,null,0]
[null,null,null,null," ",null,null,0]
[null,null,null,null," ",null,null,0]
[null,null,null,null," ",null,null,0]
[null,null,null,null," ",null,null,0]
[null,null,null,null," ",null,null,0]
[null,null,null,null," ",null,null,0]
[null,null,null,null," ",null,null,0]
[null,null,null,null," ",null,null,0]
[null,null,null,null," ",null,null,0]
[null,null,null,null," ",null,null,0]
[null,null,null,null," ",null,null,0]
[null,null,null,null," ",null,null,0]
[null,null,null,null," ",null,null,0]
[null,null,null,null," ",null,null,0]
[null,null,null,null," ",null,null,0]
[null,null,null,null," ",null,null,0]
[null,null,null,null," ",null,null,0]
[null,null,null,null," ",null,null,0]
[null,null,null,null," ",null,null,0]
[null,null,null,null," ",null,null,0]
[null,null,null,null," ",null,null,0]
[null,null,null,null," ",null,null,0]
[null,null,null,null," ",null,null,0]
[null,null,null,null," ",null,null,0]
[null,null,null,null," ",null,null,0]
[null,null,null,null," ",null,null,0]
[null,null,null,null," ",null,null,0]
[null,null,null,null," ",null,null,0]
[null,null,null,null," ",null,null,0]
[null,null,null,null," ",null,null,0]
[null,null,null,null," ",null,null,0]
[null,null,null,null," ",null,null,0]
[null,null,null,null," ",null,null,0]
[null,null,null,null," ",null,null,0]
[null,null,null,null," ",null,null,0]
[null,null,null,null," ",null,null,0]
[null,null,null,null," ",null,null,0]
[null,null,null,null," ",null,null,0]
[null,null,null,null," ",null,null,0]
[null,null,null,null," ",null,null,0]
[null,null,null,null," ",null,null,0]
[null,null,null,null," ",null,null,0]
[null,null,null,null," ",null,null,0]
[null,null,null,null," ",null,null,0]
[null,null,null,null," ",null,null,0]
[null,null,null,null," ",null,null,0]
[null,null,null,null," ",null,null,0]
[null,null,null,null," ",null,null,0]
[null,null,null,null," ",null,null,0]
[null,null,null,null," ",null,null,0]
[null,null,null,null," ",null,null,0]
[null,null,null,null," ",null,null,0]
[null,null,null,null," ",null,null,0]
[null,null,null,null," ",null,null,0]
[null,null,null,null," ",null,null,0]
[null,null,null,null," ",null,null,0]
[null,null,null,null," ",null,null,0]
[null,null,null,null," ",null,null,0]
[null,null,null,null," ",null,null,0]
[null,null,null,null,{"$f":"IF(D4681>0,VLOOKUP(D4681,entidades,2,FALSE),\" \")","v":" "},null,null,{"$f":"+F4681+G4681","v":0}]
[null,null,null,null," ",null,null,0]
[null,null,null,null," ",null,null,0]
[null,null,null,null," ",null,null,0]
[null,null,null,null," ",null,null,0]
[null,null,null,null," ",null,null,0]
[null,null,null,null," ",null,null,0]
[null,null,null,null," ",null,null,0]
[null,null,null,null," ",null,null,0]
[null,null,null,null," ",null,null,0]
[null,null,null,null," ",null,null,0]
[null,null,null,null," ",null,null,0]
[null,null,null,null," ",null,null,0]
[null,null,null,null," ",null,null,0]
[null,null,null,null," ",null,null,0]
[null,null,null,null," ",null,null,0]
[null,null,null,null," ",null,null,0]
[null,null,null,null," ",null,null,0]
[null,null,null,null," ",null,null,0]
[null,null,null,null," ",null,null,0]
[null,null,null,null," ",null,null,0]
[null,null,null,null," ",null,null,0]
[null,null,null,null," ",null,null,0]
[null,null,null,null," ",null,null,0]
[null,null,null,null," ",null,null,0]
[null,null,null,null," ",null,null,0]
[null,null,null,null," ",null,null,0]
[null,null,null,null," ",null,null,0]
[null,null,null,null," ",null,null,0]
[null,null,null,null," ",null,null,0]
[null,null,null,null," ",null,null,0]
[null,null,null,null," ",null,null,0]
[null,null,null,null," ",null,null,0]
[null,null,null,null," ",null,null,0]
[null,null,null,null," ",null,null,0]
[null,null,null,null," ",null,null,0]
[null,null,null,null," ",null,null,0]
[null,null,null,null," ",null,null,0]
[null,null,null,null," ",null,null,0]
[null,null,null,null," ",null,null,0]
[null,null,null,null," ",null,null,0]
[null,null,null,null," ",null,null,0]
[null,null,null,null," ",null,null,0]
[null,null,null,null," ",null,null,0]
[null,null,null,null," ",null,null,0]
[null,null,null,null," ",null,null,0]
[null,null,null,null," ",null,null,0]
[null,null,null,null," ",null,null,0]
[null,null,null,null," ",null,null,0]
[null,null,null,null," ",null,null,0]
[null,null,null,null," ",null,null,0]
[null,null,null,null," ",null,null,0]
[null,null,null,null," ",null,null,0]
[null,null,null,null," ",null,null,0]
[null,null,null,null," ",null,null,0]
[null,null,null,null," ",null,null,0]
[null,null,null,null," ",null,null,0]
[null,null,null,null," ",null,null,0]
[null,null,null,null," ",null,null,0]
[null,null,null,null," ",null,null,0]
[null,null,null,null," ",null,null,0]
[null,null,null,null," ",null,null,0]
[null,null,null,null," ",null,null,0]
[null,null,null,null," ",null,null,0]
[null,null,null,null,{"$f":"IF(D4745>0,VLOOKUP(D4745,entidades,2,FALSE),\" \")","v":" "},null,null,{"$f":"+F4745+G4745","v":0}]
[null,null,null,null," ",null,null,0]
[null,null,null,null," ",null,null,0]
[null,null,null,null," ",null,null,0]
[null,null,null,null," ",null,null,0]
[null,null,null,null," ",null,null,0]
[null,null,null,null," ",null,null,0]
[null,null,null,null," ",null,null,0]
[null,null,null,null," ",null,null,0]
[null,null,null,null," ",null,null,0]
[null,null,null,null," ",null,null,0]
[null,null,null,null," ",null,null,0]
[null,null,null,null," ",null,null,0]
[null,null,null,null," ",null,null,0]
[null,null,null,null," ",null,null,0]
[null,null,null,null," ",null,null,0]
[null,null,null,null," ",null,null,0]
[null,null,null,null," ",null,null,0]
[null,null,null,null," ",null,null,0]
[null,null,null,null," ",null,null,0]
[null,null,null,null," ",null,null,0]
[null,null,null,null," ",null,null,0]
[null,null,null,null," ",null,null,0]
[null,null,null,null," ",null,null,0]
[null,null,null,null," ",null,null,0]
[null,null,null,null," ",null,null,0]
[null,null,null,null," ",null,null,0]
[null,null,null,null," ",null,null,0]
[null,null,null,null," ",null,null,0]
[null,null,null,null," ",null,null,0]
[null,null,null,null," ",null,null,0]
[null,null,null,null," ",null,null,0]
[null,null,null,null," ",null,null,0]
[null,null,null,null," ",null,null,0]
[null,null,null,null," ",null,null,0]
[null,null,null,null," ",null,null,0]
[null,null,null,null," ",null,null,0]
[null,null,null,null," ",null,null,0]
[null,null,null,null," ",null,null,0]
[null,null,null,null," ",null,null,0]
[null,null,null,null," ",null,null,0]
[null,null,null,null," ",null,null,0]
[null,null,null,null," ",null,null,0]
[null,null,null,null," ",null,null,0]
[null,null,null,null," ",null,null,0]
[null,null,null,null," ",null,null,0]
[null,null,null,null," ",null,null,0]
[null,null,null,null," ",null,null,0]
[null,null,null,null," ",null,null,0]
[null,null,null,null," ",null,null,0]
[null,null,null,null," ",null,null,0]
[null,null,null,null," ",null,null,0]
[null,null,null,null," ",null,null,0]
[null,null,null,null," ",null,null,0]
[null,null,null,null," ",null,null,0]
[null,null,null,null," ",null,null,0]
[null,null,null,null," ",null,null,0]
[null,null,null,null," ",null,null,0]
[null,null,null,null," ",null,null,0]
[null,null,null,null," ",null,null,0]
[null,null,null,null," ",null,null,0]
[null,null,null,null," ",null,null,0]
[null,null,null,null," ",null,null,0]
[null,null,null,null," ",null,null,0]
[null,null,null,null,{"$f":"IF(D4809>0,VLOOKUP(D4809,entidades,2,FALSE),\" \")","v":" "},null,null,{"$f":"+F4809+G4809","v":0}]
[null,null,null,null," ",null,null,0]
[null,null,null,null," ",null,null,0]
[null,null,null,null," ",null,null,0]
[null,null,null,null," ",null,null,0]
[null,null,null,null," ",null,null,0]
[null,null,null,null," ",null,null,0]
[null,null,null,null," ",null,null,0]
[null,null,null,null," ",null,null,0]
[null,null,null,null," ",null,null,0]
[null,null,null,null," ",null,null,0]
[null,null,null,null," ",null,null,0]
[null,null,null,null," ",null,null,0]
[null,null,null,null," ",null,null,0]
[null,null,null,null," ",null,null,0]
[null,null,null,null," ",null,null,0]
[null,null,null,null," ",null,null,0]
[null,null,null,null," ",null,null,0]
[null,null,null,null," ",null,null,0]
[null,null,null,null," ",null,null,0]
[null,null,null,null," ",null,null,0]
[null,null,null,null," ",null,null,0]
[null,null,null,null," ",null,null,0]
[null,null,null,null," ",null,null,0]
[null,null,null,null," ",null,null,0]
[null,null,null,null," ",null,null,0]
[null,null,null,null," ",null,null,0]
[null,null,null,null," ",null,null,0]
[null,null,null,null," ",null,null,0]
[null,null,null,null," ",null,null,0]
[null,null,null,null," ",null,null,0]
[null,null,null,null," ",null,null,0]
[null,null,null,null," ",null,null,0]
[null,null,null,null," ",null,null,0]
[null,null,null,null," ",null,null,0]
[null,null,null,null," ",null,null,0]
[null,null,null,null," ",null,null,0]
[null,null,null,null," ",null,null,0]
[null,null,null,null," ",null,null,0]
[null,null,null,null," ",null,null,0]
[null,null,null,null," ",null,null,0]
[null,null,null,null," ",null,null,0]
[null,null,null,null," ",null,null,0]
[null,null,null,null," ",null,null,0]
[null,null,null,null," ",null,null,0]
[null,null,null,null," ",null,null,0]
[null,null,null,null," ",null,null,0]
[null,null,null,null," ",null,null,0]
[null,null,null,null," ",null,null,0]
[null,null,null,null," ",null,null,0]
[null,null,null,null," ",null,null,0]
[null,null,null,null," ",null,null,0]
[null,null,null,null," ",null,null,0]
[null,null,null,null," ",null,null,0]
[null,null,null,null," ",null,null,0]
[null,null,null,null," ",null,null,0]
[null,null,null,null," ",null,null,0]
[null,null,null,null," ",null,null,0]
[null,null,null,null," ",null,null,0]
[null,null,null,null," ",null,null,0]
[null,null,null,null," ",null,null,0]
[null,null,null,null," ",null,null,0]
[null,null,null,null," ",null,null,0]
[null,null,null,null," ",null,null,0]
[null,null,null,null,{"$f":"IF(D4873>0,VLOOKUP(D4873,entidades,2,FALSE),\" \")","v":" "},null,null,{"$f":"+F4873+G4873","v":0}]
[null,null,null,null," ",null,null,0]
[null,null,null,null," ",null,null,0]
[null,null,null,null," ",null,null,0]
[null,null,null,null," ",null,null,0]
[null,null,null,null," ",null,null,0]
[null,null,null,null," ",null,null,0]
[null,null,null,null," ",null,null,0]
[null,null,null,null," ",null,null,0]
[null,null,null,null," ",null,null,0]
[null,null,null,null," ",null,null,0]
[null,null,null,null," ",null,null,0]
[null,null,null,null," ",null,null,0]
[null,null,null,null," ",null,null,0]
[null,null,null,null," ",null,null,0]
[null,null,null,null," ",null,null,0]
[null,null,null,null," ",null,null,0]
[null,null,null,null," ",null,null,0]
[null,null,null,null," ",null,null,0]
[null,null,null,null," ",null,null,0]
[null,null,null,null," ",null,null,0]

{"sheet":"Etapa 1","index":5,"n_rows":90,"n_cols":18,"rows_kept":90,"cut":false,"hidden":false,"merged":[[1,6,1,9],[0,6,0,11]]}
[null,"Etapa 1",null,null,null,"Proyecto:",{"$f":"+Inicio!$B$9","v":"Escriba el nombre del proyecto postulado…"}]
[null,"Puesta en Marcha y Posicionamiento",null,null,null,"Beneficiario:",{"$f":"VLOOKUP(\"Beneficiario Mandatario\",Participantes!$B$2:$F$86,5,FALSE)","v":{"$error":"#N/A"}}]
[null,null,null,"RRHH (MM$)",null,null,"Operaciones (MM$)",null,null,"Inversiones (MM$)",null,null,"Administración (MM$)",null,null,"TOTAL (MM$)"]
[null,null,null,{"$f":"SUBTOTAL(9,D6:D90)","v":0},{"$f":"SUBTOTAL(9,E6:E90)","v":0},0,0,0,0,0,0,0,0,0,0,0,0,0]
[null,"Nombre Entidad","Tipo","Pecuniario","Valorizado","Subtotal","Pecuniario","Valorizado","Subtotal","Pecuniario","Valorizado","Subtotal","Pecuniario","Valorizado","Subtotal","Pecuniario","Valorizado","Subtotal"]
[null,"Corfo",{"$f":"IF(B6>0,(VLOOKUP(B6,entidades,2,FALSE)),\" \")","v":"Corfo"},null,null,{"$f":"+D6+E6","v":0},null,null,{"$f":"+G6+H6","v":0},null,null,{"$f":"+J6+K6","v":0},null,null,{"$f":"+M6+N6","v":0},{"$f":"+D6+G6+J6+M6","v":0},{"$f":"+E6+H6+K6+N6","v":0},{"$f":"+P6+Q6","v":0}]
[null,null," ",null,null,0,null,null,0,null,null,0,null,null,0,0,0,0]
[null,null," ",null,null,0,null,null,0,null,null,0,null,null,0,0,0,0]
[null,null," ",null,null,0,null,null,0,null,null,0,null,null,0,0,0,0]
[null,null," ",null,null,0,null,null,0,null,null,0,null,null,0,0,0,0]
[null,null," ",null,null,0,null,null,0,null,null,0,null,null,0,0,0,0]
[null,null," ",null,null,0,null,null,0,null,null,0,null,null,0,0,0,0]
[null,null," ",null,null,0,null,null,0,null,null,0,null,null,0,0,0,0]
[null,null," ",null,null,0,null,null,0,null,null,0,null,null,0,0,0,0]
[null,null," ",null,null,0,null,null,0,null,null,0,null,null,0,0,0,0]
[null,null," ",null,null,0,null,null,0,null,null,0,null,null,0,0,0,0]
[null,null," ",null,null,0,null,null,0,null,null,0,null,null,0,0,0,0]
[null,null," ",null,null,0,null,null,0,null,null,0,null,null,0,0,0,0]
[null,null," ",null,null,0,null,null,0,null,null,0,null,null,0,0,0,0]
[null,null," ",null,null,0,null,null,0,null,null,0,null,null,0,0,0,0]
[null,null," ",null,null,0,null,null,0,null,null,0,null,null,0,0,0,0]
[null,null," ",null,null,0,null,null,0,null,null,0,null,null,0,0,0,0]
[null,null," ",null,null,0,null,null,0,null,null,0,null,null,0,0,0,0]
[null,null," ",null,null,0,null,null,0,null,null,0,null,null,0,0,0,0]
[null,null," ",null,null,0,null,null,0,null,null,0,null,null,0,0,0,0]
[null,null," ",null,null,0,null,null,0,null,null,0,null,null,0,0,0,0]
[null,null," ",null,null,0,null,null,0,null,null,0,null,null,0,0,0,0]
[null,null," ",null,null,0,null,null,0,null,null,0,null,null,0,0,0,0]
[null,null," ",null,null,0,null,null,0,null,null,0,null,null,0,0,0,0]
[null,null," ",null,null,0,null,null,0,null,null,0,null,null,0,0,0,0]
[null,null," ",null,null,0,null,null,0,null,null,0,null,null,0,0,0,0]
[null,null," ",null,null,0,null,null,0,null,null,0,null,null,0,0,0,0]
[null,null," ",null,null,0,null,null,0,null,null,0,null,null,0,0,0,0]
[null,null," ",null,null,0,null,null,0,null,null,0,null,null,0,0,0,0]
[null,null," ",null,null,0,null,null,0,null,null,0,null,null,0,0,0,0]
[null,null," ",null,null,0,null,null,0,null,null,0,null,null,0,0,0,0]
[null,null," ",null,null,0,null,null,0,null,null,0,null,null,0,0,0,0]
[null,null,{"$f":"IF(B38>0,(VLOOKUP(B38,entidades,2,FALSE)),\" \")","v":" "},null,null,{"$f":"+D38+E38","v":0},null,null,{"$f":"+G38+H38","v":0},null,null,{"$f":"+J38+K38","v":0},null,null,{"$f":"+M38+N38","v":0},{"$f":"+D38+G38+J38+M38","v":0},{"$f":"+E38+H38+K38+N38","v":0},{"$f":"+P38+Q38","v":0}]
[null,null," ",null,null,0,null,null,0,null,null,0,null,null,0,0,0,0]
[null,null," ",null,null,0,null,null,0,null,null,0,null,null,0,0,0,0]
[null,null," ",null,null,0,null,null,0,null,null,0,null,null,0,0,0,0]
[null,null," ",null,null,0,null,null,0,null,null,0,null,null,0,0,0,0]
[null,null," ",null,null,0,null,null,0,null,null,0,null,null,0,0,0,0]
[null,null," ",null,null,0,null,null,0,null,null,0,null,null,0,0,0,0]
[null,null," ",null,null,0,null,null,0,null,null,0,null,null,0,0,0,0]
[null,null," ",null,null,0,null,null,0,null,null,0,null,null,0,0,0,0]
[null,null," ",null,null,0,null,null,0,null,null,0,null,null,0,0,0,0]
[null,null," ",null,null,0,null,null,0,null,null,0,null,null,0,0,0,0]
[null,null," ",null,null,0,null,null,0,null,null,0,null,null,0,0,0,0]
[null,null," ",null,null,0,null,null,0,null,null,0,null,null,0,0,0,0]
[null,null," ",null,null,0,null,null,0,null,null,0,null,null,0,0,0,0]
[null,null," ",null,null,0,null,null,0,null,null,0,null,null,0,0,0,0]
[null,null," ",null,null,0,null,null,0,null,null,0,null,null,0,0,0,0]
[null,null," ",null,null,0,null,null,0,null,null,0,null,null,0,0,0,0]
[null,null," ",null,null,0,null,null,0,null,null,0,null,null,0,0,0,0]
[null,null," ",null,null,0,null,null,0,null,null,0,null,null,0,0,0,0]
[null,null," ",null,null,0,null,null,0,null,null,0,null,null,0,0,0,0]
[null,null," ",null,null,0,null,null,0,null,null,0,null,null,0,0,0,0]
[null,null," ",null,null,0,null,null,0,null,null,0,null,null,0,0,0,0]
[null,null," ",null,null,0,null,null,0,null,null,0,null,null,0,0,0,0]
[null,null," ",null,null,0,null,null,0,null,null,0,null,null,0,0,0,0]
[null,null," ",null,null,0,null,null,0,null,null,0,null,null,0,0,0,0]
[null,null," ",null,null,0,null,null,0,null,null,0,null,null,0,0,0,0]
[null,null," ",null,null,0,null,null,0,null,null,0,null,null,0,0,0,0]
[null,null," ",null,null,0,null,null,0,null,null,0,null,null,0,0,0,0]
[null,null," ",null,null,0,null,null,0,null,null,0,null,null,0,0,0,0]
[null,null," ",null,null,0,null,null,0,null,null,0,null,null,0,0,0,0]
[null,null," ",null,null,0,null,null,0,null,null,0,null,null,0,0,0,0]
[null,null," ",null,null,0,null,null,0,null,null,0,null,null,0,0,0,0]
[null,null,{"$f":"IF(B70>0,(VLOOKUP(B70,entidades,2,FALSE)),\" \")","v":" "},null,null,{"$f":"+D70+E70","v":0},null,null,{"$f":"+G70+H70","v":0},null,null,{"$f":"+J70+K70","v":0},null,null,{"$f":"+M70+N70","v":0},{"$f":"+D70+G70+J70+M70","v":0},{"$f":"+E70+H70+K70+N70","v":0},{"$f":"+P70+Q70","v":0}]
[null,null," ",null,null,0,null,null,0,null,null,0,null,null,0,0,0,0]
[null,null," ",null,null,0,null,null,0,null,null,0,null,null,0,0,0,0]
[null,null," ",null,null,0,null,null,0,null,null,0,null,null,0,0,0,0]
[null,null," ",null,null,0,null,null,0,null,null,0,null,null,0,0,0,0]
[null,null," ",null,null,0,null,null,0,null,null,0,null,null,0,0,0,0]
[null,null," ",null,null,0,null,null,0,null,null,0,null,null,0,0,0,0]
[null,null," ",null,null,0,null,null,0,null,null,0,null,null,0,0,0,0]
[null,null," ",null,null,0,null,null,0,null,null,0,null,null,0,0,0,0]
[null,null," ",null,null,0,null,null,0,null,null,0,null,null,0,0,0,0]
[null,null," ",null,null,0,null,null,0,null,null,0,null,null,0,0,0,0]
[null,null," ",null,null,0,null,null,0,null,null,0,null,null,0,0,0,0]
[null,null," ",null,null,0,null,null,0,null,null,0,null,null,0,0,0,0]
[null,null," ",null,null,0,null,null,0,null,null,0,null,null,0,0,0,0]
[null,null," ",null,null,0,null,null,0,null,null,0,null,null,0,0,0,0]
[null,null," ",null,null,0,null,null,0,null,null,0,null,null,0,0,0,0]
[null,null," ",null,null,0,null,null,0,null,null,0,null,null,0,0,0,0]
[null,null," ",null,null,0,null,null,0,null,null,0,null,null,0,0,0,0]
[null,null," ",null,null,0,null,null,0,null,null,0,null,null,0,0,0,0]
[null,null," ",null,null,0,null,null,0,null,null,0,null,null,0,0,0,0]
[null,null," ",null,null,0,null,null,0,null,null,0,null,null,0,0,0,0]

{"sheet":"Año 3 E1","index":6,"n_rows":90,"n_cols":18,"rows_kept":90,"cut":false,"hidden":true,"merged":[[0,6,0,11],[1,6,1,9]]}
[null,"Año 3 - Etapa 1",null,null,null,"Proyecto:",{"$f":"+Inicio!$B$9","v":"Escriba el nombre del proyecto postulado…"}]
[null,"Puesta en Marcha y Posicionamiento",null,null,null,"Beneficiario:",{"$f":"VLOOKUP(\"Beneficiario Mandatario\",Participantes!$B$2:$F$86,5,FALSE)","v":{"$error":"#N/A"}}]
[null,null,null,"RRHH (MM$)",null,null,"Operaciones (MM$)",null,null,"Inversiones (MM$)",null,null,"Administración (MM$)",null,null,"TOTAL (MM$)"]
[null,null,null,{"$f":"SUBTOTAL(9,D6:D90)","v":0},{"$f":"SUBTOTAL(9,E6:E90)","v":0},0,0,0,0,0,0,0,0,0,0,0,0,0]
[null,"Nombre Entidad","Tipo","Pecuniario","Valorizado","Subtotal","Pecuniario","Valorizado","Subtotal","Pecuniario","Valorizado","Subtotal","Pecuniario","Valorizado","Subtotal","Pecuniario","Valorizado","Subtotal"]
[null,null,{"$f":"IF(B6>0,(VLOOKUP(B6,entidades,2,FALSE)),\" \")","v":" "},null,null,{"$f":"+D6+E6","v":0},null,null,{"$f":"+G6+H6","v":0},null,null,{"$f":"+J6+K6","v":0},null,null,{"$f":"+M6+N6","v":0},{"$f":"+D6+G6+J6+M6","v":0},{"$f":"+E6+H6+K6+N6","v":0},{"$f":"+P6+Q6","v":0}]
[null,null," ",null,null,0,null,null,0,null,null,0,null,null,0,0,0,0]
[null,null," ",null,null,0,null,null,0,null,null,0,null,null,0,0,0,0]
[null,null," ",null,null,0,null,null,0,null,null,0,null,null,0,0,0,0]
[null,null," ",null,null,0,null,null,0,null,null,0,null,null,0,0,0,0]
[null,null," ",null,null,0,null,null,0,null,null,0,null,null,0,0,0,0]
[null,null," ",null,null,0,null,null,0,null,null,0,null,null,0,0,0,0]
[null,null," ",null,null,0,null,null,0,null,null,0,null,null,0,0,0,0]
[null,null," ",null,null,0,null,null,0,null,null,0,null,null,0,0,0,0]
[null,null," ",null,null,0,null,null,0,null,null,0,null,null,0,0,0,0]
[null,null," ",null,null,0,null,null,0,null,null,0,null,null,0,0,0,0]
[null,null," ",null,null,0,null,null,0,null,null,0,null,null,0,0,0,0]
[null,null," ",null,null,0,null,null,0,null,null,0,null,null,0,0,0,0]
[null,null," ",null,null,0,null,null,0,null,null,0,null,null,0,0,0,0]
[null,null," ",null,null,0,null,null,0,null,null,0,null,null,0,0,0,0]
[null,null," ",null,null,0,null,null,0,null,null,0,null,null,0,0,0,0]
[null,null," ",null,null,0,null,null,0,null,null,0,null,null,0,0,0,0]
[null,null," ",null,null,0,null,null,0,null,null,0,null,null,0,0,0,0]
[null,null," ",null,null,0,null,null,0,null,null,0,null,null,0,0,0,0]
[null,null," ",null,null,0,null,null,0,null,null,0,null,null,0,0,0,0]
[null,null," ",null,null,0,null,null,0,null,null,0,null,null,0,0,0,0]
[null,null," ",null,null,0,null,null,0,null,null,0,null,null,0,0,0,0]
[null,null," ",null,null,0,null,null,0,null,null,0,null,null,0,0,0,0]
[null,null," ",null,null,0,null,null,0,null,null,0,null,null,0,0,0,0]
[null,null," ",null,null,0,null,null,0,null,null,0,null,null,0,0,0,0]
[null,null," ",null,null,0,null,null,0,null,null,0,null,null,0,0,0,0]
[null,null," ",null,null,0,null,null,0,null,null,0,null,null,0,0,0,0]
[null,null," ",null,null,0,null,null,0,null,null,0,null,null,0,0,0,0]
[null,null," ",null,null,0,null,null,0,null,null,0,null,null,0,0,0,0]
[null,null," ",null,null,0,null,null,0,null,null,0,null,null,0,0,0,0]
[null,null," ",null,null,0,null,null,0,null,null,0,null,null,0,0,0,0]
[null,null," ",null,null,0,null,null,0,null,null,0,null,null,0,0,0,0]
[null,null,{"$f":"IF(B38>0,(VLOOKUP(B38,entidades,2,FALSE)),\" \")","v":" "},null,null,{"$f":"+D38+E38","v":0},null,null,{"$f":"+G38+H38","v":0},null,null,{"$f":"+J38+K38","v":0},null,null,{"$f":"+M38+N38","v":0},{"$f":"+D38+G38+J38+M38","v":0},{"$f":"+E38+H38+K38+N38","v":0},{"$f":"+P38+Q38","v":0}]
[null,null," ",null,null,0,null,null,0,null,null,0,null,null,0,0,0,0]
[null,null," ",null,null,0,null,null,0,null,null,0,null,null,0,0,0,0]
[null,null," ",null,null,0,null,null,0,null,null,0,null,null,0,0,0,0]
[null,null," ",null,null,0,null,null,0,null,null,0,null,null,0,0,0,0]
[null,null," ",null,null,0,null,null,0,null,null,0,null,null,0,0,0,0]
[null,null," ",null,null,0,null,null,0,null,null,0,null,null,0,0,0,0]
[null,null," ",null,null,0,null,null,0,null,null,0,null,null,0,0,0,0]
[null,null," ",null,null,0,null,null,0,null,null,0,null,null,0,0,0,0]
[null,null," ",null,null,0,null,null,0,null,null,0,null,null,0,0,0,0]
[null,null," ",null,null,0,null,null,0,null,null,0,null,null,0,0,0,0]
[null,null," ",null,null,0,null,null,0,null,null,0,null,null,0,0,0,0]
[null,null," ",null,null,0,null,null,0,null,null,0,null,null,0,0,0,0]
[null,null," ",null,null,0,null,null,0,null,null,0,null,null,0,0,0,0]
[null,null," ",null,null,0,null,null,0,null,null,0,null,null,0,0,0,0]
[null,null," ",null,null,0,null,null,0,null,null,0,null,null,0,0,0,0]
[null,null," ",null,null,0,null,null,0,null,null,0,null,null,0,0,0,0]
[null,null," ",null,null,0,null,null,0,null,null,0,null,null,0,0,0,0]
[null,null," ",null,null,0,null,null,0,null,null,0,null,null,0,0,0,0]
[null,null," ",null,null,0,null,null,0,null,null,0,null,null,0,0,0,0]
[null,null," ",null,null,0,null,null,0,null,null,0,null,null,0,0,0,0]
[null,null," ",null,null,0,null,null,0,null,null,0,null,null,0,0,0,0]
[null,null," ",null,null,0,null,null,0,null,null,0,null,null,0,0,0,0]
[null,null," ",null,null,0,null,null,0,null,null,0,null,null,0,0,0,0]
[null,null," ",null,null,0,null,null,0,null,null,0,null,null,0,0,0,0]
[null,null," ",null,null,0,null,null,0,null,null,0,null,null,0,0,0,0]
[null,null," ",null,null,0,null,null,0,null,null,0,null,null,0,0,0,0]
[null,null," ",null,null,0,null,null,0,null,null,0,null,null,0,0,0,0]
[null,null," ",null,null,0,null,null,0,null,null,0,null,null,0,0,0,0]
[null,null," ",null,null,0,null,null,0,null,null,0,null,null,0,0,0,0]
[null,null," ",null,null,0,null,null,0,null,null,0,null,null,0,0,0,0]
[null,null," ",null,null,0,null,null,0,null,null,0,null,null,0,0,0,0]
[null,null,{"$f":"IF(B70>0,(VLOOKUP(B70,entidades,2,FALSE)),\" \")","v":" "},null,null,{"$f":"+D70+E70","v":0},null,null,{"$f":"+G70+H70","v":0},null,null,{"$f":"+J70+K70","v":0},null,null,{"$f":"+M70+N70","v":0},{"$f":"+D70+G70+J70+M70","v":0},{"$f":"+E70+H70+K70+N70","v":0},{"$f":"+P70+Q70","v":0}]
[null,null," ",null,null,0,null,null,0,null,null,0,null,null,0,0,0,0]
[null,null," ",null,null,0,null,null,0,null,null,0,null,null,0,0,0,0]
[null,null," ",null,null,0,null,null,0,null,null,0,null,null,0,0,0,0]
[null,null," ",null,null,0,null,null,0,null,null,0,null,null,0,0,0,0]
[null,null," ",null,null,0,null,null,0,null,null,0,null,null,0,0,0,0]
[null,null," ",null,null,0,null,null,0,null,null,0,null,null,0,0,0,0]
[null,null," ",null,null,0,null,null,0,null,null,0,null,null,0,0,0,0]
[null,null," ",null,null,0,null,null,0,null,null,0,null,null,0,0,0,0]
[null,null," ",null,null,0,null,null,0,null,null,0,null,null,0,0,0,0]
[null,null," ",null,null,0,null,null,0,null,null,0,null,null,0,0,0,0]
[null,null," ",null,null,0,null,null,0,null,null,0,null,null,0,0,0,0]
[null,null," ",null,null,0,null,null,0,null,null,0,null,null,0,0,0,0]
[null,null," ",null,null,0,null,null,0,null,null,0,null,null,0,0,0,0]
[null,null," ",null,null,0,null,null,0,null,null,0,null,null,0,0,0,0]
[null,null," ",null,null,0,null,null,0,null,null,0,null,null,0,0,0,0]
[null,null," ",null,null,0,null,null,0,null,null,0,null,null,0,0,0,0]
[null,null," ",null,null,0,null,null,0,null,null,0,null,null,0,0,0,0]
[null,null," ",null,null,0,null,null,0,null,null,0,null,null,0,0,0,0]
[null,null," ",null,null,0,null,null,0,null,null,0,null,null,0,0,0,0]
[null,null," ",null,null,0,null,null,0,null,null,0,null,null,0,0,0,0]

{"sheet":"Etapa 2","index":7,"n_rows":90,"n_cols":18,"rows_kept":90,"cut":false,"hidden":false,"merged":[[0,6,0,11],[1,6,1,9]]}
[null,"Etapa 2",null,null,null,"Proyecto:",{"$f":"+Inicio!$B$9","v":"Escriba el nombre del proyecto postulado…"}]
[null,"Operación y Transferencia Tecnológica",null,null,null,"Beneficiario:",{"$f":"VLOOKUP(\"Beneficiario Mandatario\",Participantes!$B$2:$F$86,5,FALSE)","v":{"$error":"#N/A"}}]
[null,null,null,"RRHH (MM$)",null,null,"Operaciones (MM$)",null,null,"Inversiones (MM$)",null,null,"Administración (MM$)",null,null,"TOTAL (MM$)"]
[null,null,null,{"$f":"SUBTOTAL(9,D6:D90)","v":0},{"$f":"SUBTOTAL(9,E6:E90)","v":0},0,0,0,0,0,0,0,0,0,0,0,0,0]
[null,"Nombre Entidad","Tipo","Pecuniario","Valorizado","Subtotal","Pecuniario","Valorizado","Subtotal","Pecuniario","Valorizado","Subtotal","Pecuniario","Valorizado","Subtotal","Pecuniario","Valorizado","Subtotal"]
[null,"Corfo",{"$f":"IF(B6>0,(VLOOKUP(B6,entidades,2,FALSE)),\" \")","v":"Corfo"},null,null,{"$f":"+D6+E6","v":0},null,null,{"$f":"+G6+H6","v":0},null,null,{"$f":"+J6+K6","v":0},null,null,{"$f":"+M6+N6","v":0},{"$f":"+D6+G6+J6+M6","v":0},{"$f":"+E6+H6+K6+N6","v":0},{"$f":"+P6+Q6","v":0}]
[null,null," ",null,null,0,null,null,0,null,null,0,null,null,0,0,0,0]
[null,null," ",null,null,0,null,null,0,null,null,0,null,null,0,0,0,0]
[null,null," ",null,null,0,null,null,0,null,null,0,null,null,0,0,0,0]
[null,null," ",null,null,0,null,null,0,null,null,0,null,null,0,0,0,0]
[null,null," ",null,null,0,null,null,0,null,null,0,null,null,0,0,0,0]
[null,null," ",null,null,0,null,null,0,null,null,0,null,null,0,0,0,0]
[null,null," ",null,null,0,null,null,0,null,null,0,null,null,0,0,0,0]
[null,null," ",null,null,0,null,null,0,null,null,0,null,null,0,0,0,0]
[null,null," ",null,null,0,null,null,0,null,null,0,null,null,0,0,0,0]
[null,null," ",null,null,0,null,null,0,null,null,0,null,null,0,0,0,0]
[null,null," ",null,null,0,null,null,0,null,null,0,null,null,0,0,0,0]
[null,null," ",null,null,0,null,null,0,null,null,0,null,null,0,0,0,0]
[null,null," ",null,null,0,null,null,0,null,null,0,null,null,0,0,0,0]
[null,null," ",null,null,0,null,null,0,null,null,0,null,null,0,0,0,0]
[null,null," ",null,null,0,null,null,0,null,null,0,null,null,0,0,0,0]
[null,null," ",null,null,0,null,null,0,null,null,0,null,null,0,0,0,0]
[null,null," ",null,null,0,null,null,0,null,null,0,null,null,0,0,0,0]
[null,null," ",null,null,0,null,null,0,null,null,0,null,null,0,0,0,0]
[null,null," ",null,null,0,null,null,0,null,null,0,null,null,0,0,0,0]
[null,null," ",null,null,0,null,null,0,null,null,0,null,null,0,0,0,0]
[null,null," ",null,null,0,null,null,0,null,null,0,null,null,0,0,0,0]
[null,null," ",null,null,0,null,null,0,null,null,0,null,null,0,0,0,0]
[null,null," ",null,null,0,null,null,0,null,null,0,null,null,0,0,0,0]
[null,null," ",null,null,0,null,null,0,null,null,0,null,null,0,0,0,0]
[null,null," ",null,null,0,null,null,0,null,null,0,null,null,0,0,0,0]
[null,null," ",null,null,0,null,null,0,null,null,0,null,null,0,0,0,0]
[null,null," ",null,null,0,null,null,0,null,null,0,null,null,0,0,0,0]
[null,null," ",null,null,0,null,null,0,null,null,0,null,null,0,0,0,0]
[null,null," ",null,null,0,null,null,0,null,null,0,null,null,0,0,0,0]
[null,null," ",null,null,0,null,null,0,null,null,0,null,null,0,0,0,0]
[null,null," ",null,null,0,null,null,0,null,null,0,null,null,0,0,0,0]
[null,null,{"$f":"IF(B38>0,(VLOOKUP(B38,entidades,2,FALSE)),\" \")","v":" "},null,null,{"$f":"+D38+E38","v":0},null,null,{"$f":"+G38+H38","v":0},null,null,{"$f":"+J38+K38","v":0},null,null,{"$f":"+M38+N38","v":0},{"$f":"+D38+G38+J38+M38","v":0},{"$f":"+E38+H38+K38+N38","v":0},{"$f":"+P38+Q38","v":0}]
[null,null," ",null,null,0,null,null,0,null,null,0,null,null,0,0,0,0]
[null,null," ",null,null,0,null,null,0,null,null,0,null,null,0,0,0,0]
[null,null," ",null,null,0,null,null,0,null,null,0,null,null,0,0,0,0]
[null,null," ",null,null,0,null,null,0,null,null,0,null,null,0,0,0,0]
[null,null," ",null,null,0,null,null,0,null,null,0,null,null,0,0,0,0]
[null,null," ",null,null,0,null,null,0,null,null,0,null,null,0,0,0,0]
[null,null," ",null,null,0,null,null,0,null,null,0,null,null,0,0,0,0]
[null,null," ",null,null,0,null,null,0,null,null,0,null,null,0,0,0,0]
[null,null," ",null,null,0,null,null,0,null,null,0,null,null,0,0,0,0]
[null,null," ",null,null,0,null,null,0,null,null,0,null,null,0,0,0,0]
[null,null," ",null,null,0,null,null,0,null,null,0,null,null,0,0,0,0]
[null,null," ",null,null,0,null,null,0,null,null,0,null,null,0,0,0,0]
[null,null," ",null,null,0,null,null,0,null,null,0,null,null,0,0,0,0]
[null,null," ",null,null,0,null,null,0,null,null,0,null,null,0,0,0,0]
[null,null," ",null,null,0,null,null,0,null,null,0,null,null,0,0,0,0]
[null,null," ",null,null,0,null,null,0,null,null,0,null,null,0,0,0,0]
[null,null," ",null,null,0,null,null,0,null,null,0,null,null,0,0,0,0]
[null,null," ",null,null,0,null,null,0,null,null,0,null,null,0,0,0,0]
[null,null," ",null,null,0,null,null,0,null,null,0,null,null,0,0,0,0]
[null,null," ",null,null,0,null,null,0,null,null,0,null,null,0,0,0,0]
[null,null," ",null,null,0,null,null,0,null,null,0,null,null,0,0,0,0]
[null,null," ",null,null,0,null,null,0,null,null,0,null,null,0,0,0,0]
[null,null," ",null,null,0,null,null,0,null,null,0,null,null,0,0,0,0]
[null,null," ",null,null,0,null,null,0,null,null,0,null,null,0,0,0,0]
[null,null," ",null,null,0,null,null,0,null,null,0,null,null,0,0,0,0]
[null,null," ",null,null,0,null,null,0,null,null,0,null,null,0,0,0,0]
[null,null," ",null,null,0,null,null,0,null,null,0,null,null,0,0,0,0]
[null,null," ",null,null,0,null,null,0,null,null,0,null,null,0,0,0,0]
[null,null," ",null,null,0,null,null,0,null,null,0,null,null,0,0,0,0]
[null,null," ",null,null,0,null,null,0,null,null,0,null,null,0,0,0,0]
[null,null," ",null,null,0,null,null,0,null,null,0,null,null,0,0,0,0]
[null,null,{"$f":"IF(B70>0,(VLOOKUP(B70,entidades,2,FALSE)),\" \")","v":" "},null,null,{"$f":"+D70+E70","v":0},null,null,{"$f":"+G70+H70","v":0},null,null,{"$f":"+J70+K70","v":0},null,null,{"$f":"+M70+N70","v":0},{"$f":"+D70+G70+J70+M70","v":0},{"$f":"+E70+H70+K70+N70","v":0},{"$f":"+P70+Q70","v":0}]
[null,null," ",null,null,0,null,null,0,null,null,0,null,null,0,0,0,0]
[null,null," ",null,null,0,null,null,0,null,null,0,null,null,0,0,0,0]
[null,null," ",null,null,0,null,null,0,null,null,0,null,null,0,0,0,0]
[null,null," ",null,null,0,null,null,0,null,null,0,null,null,0,0,0,0]
[null,null," ",null,null,0,null,null,0,null,null,0,null,null,0,0,0,0]
[null,null," ",null,null,0,null,null,0,null,null,0,null,null,0,0,0,0]
[null,null," ",null,null,0,null,null,0,null,null,0,null,null,0,0,0,0]
[null,null," ",null,null,0,null,null,0,null,null,0,null,null,0,0,0,0]
[null,null," ",null,null,0,null,null,0,null,null,0,null,null,0,0,0,0]
[null,null," ",null,null,0,null,null,0,null,null,0,null,null,0,0,0,0]
[null,null," ",null,null,0,null,null,0,null,null,0,null,null,0,0,0,0]
[null,null," ",null,null,0,null,null,0,null,null,0,null,null,0,0,0,0]
[null,null," ",null,null,0,null,null,0,null,null,0,null,null,0,0,0,0]
[null,null," ",null,null,0,null,null,0,null,null,0,null,null,0,0,0,0]
[null,null," ",null,null,0,null,null,0,null,null,0,null,null,0,0,0,0]
[null,null," ",null,null,0,null,null,0,null,null,0,null,null,0,0,0,0]
[null,null," ",null,null,0,null,null,0,null,null,0,null,null,0,0,0,0]
[null,null," ",null,null,0,null,null,0,null,null,0,null,null,0,0,0,0]
[null,null," ",null,null,0,null,null,0,null,null,0,null,null,0,0,0,0]
[null,null," ",null,null,0,null,null,0,null,null,0,null,null,0,0,0,0]

{"sheet":"Etapa 3","index":8,"n_rows":90,"n_cols":18,"rows_kept":90,"cut":false,"hidden":false,"merged":[[0,6,0,11],[1,6,1,9]]}
[null,"Etapa 3",null,null,null,"Proyecto:",{"$f":"+Inicio!$B$9","v":"Escriba el nombre del proyecto postulado…"}]
[null,"Consolidación",null,null,null,"Beneficiario:",{"$f":"VLOOKUP(\"Beneficiario Mandatario\",Participantes!$B$2:$F$86,5,FALSE)","v":{"$error":"#N/A"}}]
[null,null,null,"RRHH (MM$)",null,null,"Operaciones (MM$)",null,null,"Inversiones (MM$)",null,null,"Administración (MM$)",null,null,"TOTAL (MM$)"]
[null,null,null,{"$f":"SUM(D6:D90)","v":0},{"$f":"SUM(E6:E90)","v":0},0,0,0,0,0,0,0,0,0,0,0,0,0]
[null,"Nombre Entidad","Tipo","Pecuniario","Valorizado","Subtotal","Pecuniario","Valorizado","Subtotal","Pecuniario","Valorizado","Subtotal","Pecuniario","Valorizado","Subtotal","Pecuniario","Valorizado","Subtotal"]
[null,null,{"$f":"IF(B6>0,(VLOOKUP(B6,entidades,2,FALSE)),\" \")","v":" "},null,null,{"$f":"+D6+E6","v":0},null,null,{"$f":"+G6+H6","v":0},null,null,{"$f":"+J6+K6","v":0},null,null,{"$f":"+M6+N6","v":0},{"$f":"+D6+G6+J6+M6","v":0},{"$f":"+E6+H6+K6+N6","v":0},{"$f":"+P6+Q6","v":0}]
[null,null," ",null,null,0,null,null,0,null,null,0,null,null,0,0,0,0]
[null,null," ",null,null,0,null,null,0,null,null,0,null,null,0,0,0,0]
[null,null," ",null,null,0,null,null,0,null,null,0,null,null,0,0,0,0]
[null,null," ",null,null,0,null,null,0,null,null,0,null,null,0,0,0,0]
[null,null," ",null,null,0,null,null,0,null,null,0,null,null,0,0,0,0]
[null,null," ",null,null,0,null,null,0,null,null,0,null,null,0,0,0,0]
[null,null," ",null,null,0,null,null,0,null,null,0,null,null,0,0,0,0]
[null,null," ",null,null,0,null,null,0,null,null,0,null,null,0,0,0,0]
[null,null," ",null,null,0,null,null,0,null,null,0,null,null,0,0,0,0]
[null,null," ",null,null,0,null,null,0,null,null,0,null,null,0,0,0,0]
[null,null," ",null,null,0,null,null,0,null,null,0,null,null,0,0,0,0]
[null,null," ",null,null,0,null,null,0,null,null,0,null,null,0,0,0,0]
[null,null," ",null,null,0,null,null,0,null,null,0,null,null,0,0,0,0]
[null,null," ",null,null,0,null,null,0,null,null,0,null,null,0,0,0,0]
[null,null," ",null,null,0,null,null,0,null,null,0,null,null,0,0,0,0]
[null,null," ",null,null,0,null,null,0,null,null,0,null,null,0,0,0,0]
[null,null," ",null,null,0,null,null,0,null,null,0,null,null,0,0,0,0]
[null,null," ",null,null,0,null,null,0,null,null,0,null,null,0,0,0,0]
[null,null," ",null,null,0,null,null,0,null,null,0,null,null,0,0,0,0]
[null,null," ",null,null,0,null,null,0,null,null,0,null,null,0,0,0,0]
[null,null," ",null,null,0,null,null,0,null,null,0,null,null,0,0,0,0]
[null,null," ",null,null,0,null,null,0,null,null,0,null,null,0,0,0,0]
[null,null," ",null,null,0,null,null,0,null,null,0,null,null,0,0,0,0]
[null,null," ",null,null,0,null,null,0,null,null,0,null,null,0,0,0,0]
[null,null," ",null,null,0,null,null,0,null,null,0,null,null,0,0,0,0]
[null,null," ",null,null,0,null,null,0,null,null,0,null,null,0,0,0,0]
[null,null," ",null,null,0,null,null,0,null,null,0,null,null,0,0,0,0]
[null,null," ",null,null,0,null,null,0,null,null,0,null,null,0,0,0,0]
[null,null," ",null,null,0,null,null,0,null,null,0,null,null,0,0,0,0]
[null,null," ",null,null,0,null,null,0,null,null,0,null,null,0,0,0,0]
[null,null," ",null,null,0,null,null,0,null,null,0,null,null,0,0,0,0]
[null,null,{"$f":"IF(B38>0,(VLOOKUP(B38,entidades,2,FALSE)),\" \")","v":" "},null,null,{"$f":"+D38+E38","v":0},null,null,{"$f":"+G38+H38","v":0},null,null,{"$f":"+J38+K38","v":0},null,null,{"$f":"+M38+N38","v":0},{"$f":"+D38+G38+J38+M38","v":0},{"$f":"+E38+H38+K38+N38","v":0},{"$f":"+P38+Q38","v":0}]
[null,null," ",null,null,0,null,null,0,null,null,0,null,null,0,0,0,0]
[null,null," ",null,null,0,null,null,0,null,null,0,null,null,0,0,0,0]
[null,null," ",null,null,0,null,null,0,null,null,0,null,null,0,0,0,0]
[null,null," ",null,null,0,null,null,0,null,null,0,null,null,0,0,0,0]
[null,null," ",null,null,0,null,null,0,null,null,0,null,null,0,0,0,0]
[null,null," ",null,null,0,null,null,0,null,null,0,null,null,0,0,0,0]
[null,null," ",null,null,0,null,null,0,null,null,0,null,null,0,0,0,0]
[null,null," ",null,null,0,null,null,0,null,null,0,null,null,0,0,0,0]
[null,null," ",null,null,0,null,null,0,null,null,0,null,null,0,0,0,0]
[null,null," ",null,null,0,null,null,0,null,null,0,null,null,0,0,0,0]
[null,null," ",null,null,0,null,null,0,null,null,0,null,null,0,0,0,0]
[null,null," ",null,null,0,null,null,0,null,null,0,null,null,0,0,0,0]
[null,null," ",null,null,0,null,null,0,null,null,0,null,null,0,0,0,0]
[null,null," ",null,null,0,null,null,0,null,null,0,null,null,0,0,0,0]
[null,null," ",null,null,0,null,null,0,null,null,0,null,null,0,0,0,0]
[null,null," ",null,null,0,null,null,0,null,null,0,null,null,0,0,0,0]
[null,null," ",null,null,0,null,null,0,null,null,0,null,null,0,0,0,0]
[null,null," ",null,null,0,null,null,0,null,null,0,null,null,0,0,0,0]
[null,null," ",null,null,0,null,null,0,null,null,0,null,null,0,0,0,0]
[null,null," ",null,null,0,null,null,0,null,null,0,null,null,0,0,0,0]
[null,null," ",null,null,0,null,null,0,null,null,0,null,null,0,0,0,0]
[null,null," ",null,null,0,null,null,0,null,null,0,null,null,0,0,0,0]
[null,null," ",null,null,0,null,null,0,null,null,0,null,null,0,0,0,0]
[null,null," ",null,null,0,null,null,0,null,null,0,null,null,0,0,0,0]
[null,null," ",null,null,0,null,null,0,null,null,0,null,null,0,0,0,0]
[null,null," ",null,null,0,null,null,0,null,null,0,null,null,0,0,0,0]
[null,null," ",null,null,0,null,null,0,null,null,0,null,null,0,0,0,0]
[null,null," ",null,null,0,null,null,0,null,null,0,null,null,0,0,0,0]
[null,null," ",null,null,0,null,null,0,null,null,0,null,null,0,0,0,0]
[null,null," ",null,null,0,null,null,0,null,null,0,null,null,0,0,0,0]
[null,null," ",null,null,0,null,null,0,null,null,0,null,null,0,0,0,0]
[null,null,{"$f":"IF(B70>0,(VLOOKUP(B70,entidades,2,FALSE)),\" \")","v":" "},null,null,{"$f":"+D70+E70","v":0},null,null,{"$f":"+G70+H70","v":0},null,null,{"$f":"+J70+K70","v":0},null,null,{"$f":"+M70+N70","v":0},{"$f":"+D70+G70+J70+M70","v":0},{"$f":"+E70+H70+K70+N70","v":0},{"$f":"+P70+Q70","v":0}]
[null,null," ",null,null,0,null,null,0,null,null,0,null,null,0,0,0,0]
[null,null," ",null,null,0,null,null,0,null,null,0,null,null,0,0,0,0]
[null,null," ",null,null,0,null,null,0,null,null,0,null,null,0,0,0,0]
[null,null," ",null,null,0,null,null,0,null,null,0,null,null,0,0,0,0]
[null,null," ",null,null,0,null,null,0,null,null,0,null,null,0,0,0,0]
[null,null," ",null,null,0,null,null,0,null,null,0,null,null,0,0,0,0]
[null,null," ",null,null,0,null,null,0,null,null,0,null,null,0,0,0,0]
[null,null," ",null,null,0,null,null,0,null,null,0,null,null,0,0,0,0]
[null,null," ",null,null,0,null,null,0,null,null,0,null,null,0,0,0,0]
[null,null," ",null,null,0,null,null,0,null,null,0,null,null,0,0,0,0]
[null,null," ",null,null,0,null,null,0,null,null,0,null,null,0,0,0,0]
[null,null," ",null,null,0,null,null,0,null,null,0,null,null,0,0,0,0]
[null,null," ",null,null,0,null,null,0,null,null,0,null,null,0,0,0,0]
[null,null," ",null,null,0,null,null,0,null,null,0,null,null,0,0,0,0]
[null,null," ",null,null,0,null,null,0,null,null,0,null,null,0,0,0,0]
[null,null," ",null,null,0,null,null,0,null,null,0,null,null,0,0,0,0]
[null,null," ",null,null,0,null,null,0,null,null,0,null,null,0,0,0,0]
[null,null," ",null,null,0,null,null,0,null,null,0,null,null,0,0,0,0]
[null,null," ",null,null,0,null,null,0,null,null,0,null,null,0,0,0,0]
[null,null," ",null,null,0,null,null,0,null,null,0,null,null,0,0,0,0]

{"sheet":"Etapa 1 x Act","index":9,"n_rows":2194,"n_cols":9,"rows_kept":2194,"cut":false,"hidden":true,"merged":[[1,1,1,2]]}
[null,"Etapa 1, por Objetivos Específicos y Actividades",null,null,"Proyecto:",{"$f":"+Inicio!$B$9","v":"Escriba el nombre del proyecto postulado…"}]
[null,"Puesta en Marcha y Posicionamiento",null,null,"Beneficiario:",{"$f":"VLOOKUP(\"Beneficiario Mandatario\",Participantes!$B$2:$F$86,5,FALSE)","v":{"$error":"#N/A"}}]
[]
[null,"Adicionalmente deberá confeccionar un presupeusto para la Etapa 1 a nivel de Objetivos Específicos y sus Actividades asociadas."]
[null,"El presupuesto total debe cuadrar con el presupuesto total por cuentas."]
[null,null,null,null,null,"MM$","MM$","MM$"]
[null,null,null,null,null,{"$f":"SUBTOTAL(9,F9:F4893)","v":0},{"$f":"SUBTOTAL(9,G9:G4893)","v":0},{"$f":"SUBTOTAL(9,H9:H4893)","v":0},{"$f":"IF(H7='Tablas Resumen'!E28,\"Presupuesto cuadrado\",\"Presupuesto total no cuadra con el total del presupuesto por cuentas del proyecto\")","v":"Presupuesto cuadrado"}]
[null,"Objetivo Específico","Actividad","Fuente/Nombre Entidad","Tipo Entidad","Pecuniario","Valorizado","Subtotal"]
[null,null,null,null,{"$f":"IF(D9>0,VLOOKUP(D9,entidades,2,FALSE),\" \")","v":" "},null,null,{"$f":"+F9+G9","v":0}]
[null,null,null,null," ",null,null,0]
[null,null,null,null," ",null,null,0]
[null,null,null,null," ",null,null,0]
[null,null,null,null," ",null,null,0]
[null,null,null,null," ",null,null,0]
[null,null,null,null," ",null,null,0]
[null,null,null,null," ",null,null,0]
[null,null,null,null," ",null,null,0]
[null,null,null,null," ",null,null,0]
[null,null,null,null," ",null,null,0]
[null,null,null,null," ",null,null,0]
[null,null,null,null," ",null,null,0]
[null,null,null,null," ",null,null,0]
[null,null,null,null," ",null,null,0]
[null,null,null,null," ",null,null,0]
[null,null,null,null," ",null,null,0]
[null,null,null,null," ",null,null,0]
[null,null,null,null," ",null,null,0]
[null,null,null,null," ",null,null,0]
[null,null,null,null," ",null,null,0]
[null,null,null,null," ",null,null,0]
[null,null,null,null," ",null,null,0]
[null,null,null,null," ",null,null,0]
[null,null,null,null," ",null,null,0]
[null,null,null,null," ",null,null,0]
[null,null,null,null," ",null,null,0]
[null,null,null,null," ",null,null,0]
[null,null,null,null," ",null,null,0]
[null,null,null,null," ",null,null,0]
[null,null,null,null," ",null,null,0]
[null,null,null,null," ",null,null,0]
[null,null,null,null," ",null,null,0]
[null,null,null,null," ",null,null,0]
[null,null,null,null," ",null,null,0]
[null,null,null,null," ",null,null,0]
[null,null,null,null," ",null,null,0]
[null,null,null,null," ",null,null,0]
[null,null,null,null," ",null,null,0]
[null,null,null,null," ",null,null,0]
[null,null,null,null," ",null,null,0]
[null,null,null,null," ",null,null,0]
[null,null,null,null," ",null,null,0]
[null,null,null,null," ",null,null,0]
[null,null,null,null," ",null,null,0]
[null,null,null,null," ",null,null,0]
[null,null,null,null," ",null,null,0]
[null,null,null,null," ",null,null,0]
[null,null,null,null," ",null,null,0]
[null,null,null,null," ",null,null,0]
[null,null,null,null," ",null,null,0]
[null,null,null,null," ",null,null,0]
[null,null,null,null," ",null,null,0]
[null,null,null,null," ",null,null,0]
[null,null,null,null," ",null,null,0]
[null,null,null,null," ",null,null,0]
[null,null,null,null," ",null,null,0]
[null,null,null,null," ",null,null,0]
[null,null,null,null," ",null,null,0]
[null,null,null,null," ",null,null,0]
[null,null,null,null," ",null,null,0]
[null,null,null,null," ",null,null,0]
[null,null,null,null," ",null,null,0]
[null,null,null,null," ",null,null,0]
[null,null,null,null,{"$f":"IF(D73>0,VLOOKUP(D73,entidades,2,FALSE),\" \")","v":" "},null,null,{"$f":"+F73+G73","v":0}]
[null,null,null,null," ",null,null,0]
[null,null,null,null," ",null,null,0]
[null,null,null,null," ",null,null,0]
[null,null,null,null," ",null,null,0]
[null,null,null,null," ",null,null,0]
[null,null,null,null," ",null,null,0]
[null,null,null,null," ",null,null,0]
[null,null,null,null," ",null,null,0]
[null,null,null,null," ",null,null,0]
[null,null,null,null," ",null,null,0]
[null,null,null,null," ",null,null,0]
[null,null,null,null," ",null,null,0]
[null,null,null,null," ",null,null,0]
[null,null,null,null," ",null,null,0]
[null,null,null,null," ",null,null,0]
[null,null,null,null," ",null,null,0]
[null,null,null,null," ",null,null,0]
[null,null,null,null," ",null,null,0]
[null,null,null,null," ",null,null,0]
[null,null,null,null," ",null,null,0]
[null,null,null,null," ",null,null,0]
[null,null,null,null," ",null,null,0]
[null,null,null,null," ",null,null,0]
[null,null,null,null," ",null,null,0]
[null,null,null,null," ",null,null,0]
[null,null,null,null," ",null,null,0]
[null,null,null,null," ",null,null,0]
[null,null,null,null," ",null,null,0]
[null,null,null,null," ",null,null,0]
[null,null,null,null," ",null,null,0]
[null,null,null,null," ",null,null,0]
[null,null,null,null," ",null,null,0]
[null,null,null,null," ",null,null,0]
[null,null,null,null," ",null,null,0]
[null,null,null,null," ",null,null,0]
[null,null,null,null," ",null,null,0]
[null,null,null,null," ",null,null,0]
[null,null,null,null," ",null,null,0]
[null,null,null,null," ",null,null,0]
[null,null,null,null," ",null,null,0]
[null,null,null,null," ",null,null,0]
[null,null,null,null," ",null,null,0]
[null,null,null,null," ",null,null,0]
[null,null,null,null," ",null,null,0]
[null,null,null,null," ",null,null,0]
[null,null,null,null," ",null,null,0]
[null,null,null,null," ",null,null,0]
[null,null,null,null," ",null,null,0]
[null,null,null,null," ",null,null,0]
[null,null,null,null," ",null,null,0]
[null,null,null,null," ",null,null,0]
[null,null,null,null," ",null,null,0]
[null,null,null,null," ",null,null,0]
[null,null,null,null," ",null,null,0]
[null,null,null,null," ",null,null,0]
[null,null,null,null," ",null,null,0]
[null,null,null,null," ",null,null,0]
[null,null,null,null," ",null,null,0]
[null,null,null,null," ",null,null,0]
[null,null,null,null," ",null,null,0]
[null,null,null,null," ",null,null,0]
[null,null,null,null," ",null,null,0]
[null,null,null,null," ",null,null,0]
[null,null,null,null,{"$f":"IF(D137>0,VLOOKUP(D137,entidades,2,FALSE),\" \")","v":" "},null,null,{"$f":"+F137+G137","v":0}]
[null,null,null,null," ",null,null,0]
[null,null,null,null," ",null,null,0]
[null,null,null,null," ",null,null,0]
[null,null,null,null," ",null,null,0]
[null,null,null,null," ",null,null,0]
[null,null,null,null," ",null,null,0]
[null,null,null,null," ",null,null,0]
[null,null,null,null," ",null,null,0]
[null,null,null,null," ",null,null,0]
[null,null,null,null," ",null,null,0]
[null,null,null,null," ",null,null,0]
[null,null,null,null," ",null,null,0]
[null,null,null,null," ",null,null,0]
[null,null,null,null," ",null,null,0]
[null,null,null,null," ",null,null,0]
[null,null,null,null," ",null,null,0]
[null,null,null,null," ",null,null,0]
[null,null,null,null," ",null,null,0]
[null,null,null,null," ",null,null,0]
[null,null,null,null," ",null,null,0]
[null,null,null,null," ",null,null,0]
[null,null,null,null," ",null,null,0]
[null,null,null,null," ",null,null,0]
[null,null,null,null," ",null,null,0]
[null,null,null,null," ",null,null,0]
[null,null,null,null," ",null,null,0]
[null,null,null,null," ",null,null,0]
[null,null,null,null," ",null,null,0]
[null,null,null,null," ",null,null,0]
[null,null,null,null," ",null,null,0]
[null,null,null,null," ",null,null,0]
[null,null,null,null," ",null,null,0]
[null,null,null,null," ",null,null,0]
[null,null,null,null," ",null,null,0]
[null,null,null,null," ",null,null,0]
[null,null,null,null," ",null,null,0]
[null,null,null,null," ",null,null,0]
[null,null,null,null," ",null,null,0]
[null,null,null,null," ",null,null,0]
[null,null,null,null," ",null,null,0]
[null,null,null,null," ",null,null,0]
[null,null,null,null," ",null,null,0]
[null,null,null,null," ",null,null,0]
[null,null,null,null," ",null,null,0]
[null,null,null,null," ",null,null,0]
[null,null,null,null," ",null,null,0]
[null,null,null,null," ",null,null,0]
[null,null,null,null," ",null,null,0]
[null,null,null,null," ",null,null,0]
[null,null,null,null," ",null,null,0]
[null,null,null,null," ",null,null,0]
[null,null,null,null," ",null,null,0]
[null,null,null,null," ",null,null,0]
[null,null,null,null," ",null,null,0]
[null,null,null,null," ",null,null,0]
[null,null,null,null," ",null,null,0]
[null,null,null,null," ",null,null,0]
[null,null,null,null," ",null,null,0]
[null,null,null,null," ",null,null,0]
[null,null,null,null," ",null,null,0]
[null,null,null,null," ",null,null,0]
[null,null,null,null," ",null,null,0]
[null,null,null,null," ",null,null,0]
[null,null,null,null,{"$f":"IF(D201>0,VLOOKUP(D201,entidades,2,FALSE),\" \")","v":" "},null,null,{"$f":"+F201+G201","v":0}]
[null,null,null,null," ",null,null,0]
[null,null,null,null," ",null,null,0]
[null,null,null,null," ",null,null,0]
[null,null,null,null," ",null,null,0]
[null,null,null,null," ",null,null,0]
[null,null,null,null," ",null,null,0]
[null,null,null,null," ",null,null,0]
[null,null,null,null," ",null,null,0]
[null,null,null,null," ",null,null,0]
[null,null,null,null," ",null,null,0]
[null,null,null,null," ",null,null,0]
[null,null,null,null," ",null,null,0]
[null,null,null,null," ",null,null,0]
[null,null,null,null," ",null,null,0]
[null,null,null,null," ",null,null,0]
[null,null,null,null," ",null,null,0]
[null,null,null,null," ",null,null,0]
[null,null,null,null," ",null,null,0]
[null,null,null,null," ",null,null,0]
[null,null,null,null," ",null,null,0]
[null,null,null,null," ",null,null,0]
[null,null,null,null," ",null,null,0]
[null,null,null,null," ",null,null,0]
[null,null,null,null," ",null,null,0]
[null,null,null,null," ",null,null,0]
[null,null,null,null," ",null,null,0]
[null,null,null,null," ",null,null,0]
[null,null,null,null," ",null,null,0]
[null,null,null,null," ",null,null,0]
[null,null,null,null," ",null,null,0]
[null,null,null,null," ",null,null,0]
[null,null,null,null," ",null,null,0]
[null,null,null,null," ",null,null,0]
[null,null,null,null," ",null,null,0]
[null,null,null,null," ",null,null,0]
[null,null,null,null," ",null,null,0]
[null,null,null,null," ",null,null,0]
[null,null,null,null," ",null,null,0]
[null,null,null,null," ",null,null,0]
[null,null,null,null," ",null,null,0]
[null,null,null,null," ",null,null,0]
[null,null,null,null," ",null,null,0]
[null,null,null,null," ",null,null,0]
[null,null,null,null," ",null,null,0]
[null,null,null,null," ",null,null,0]
[null,null,null,null," ",null,null,0]
[null,null,null,null," ",null,null,0]
[null,null,null,null," ",null,null,0]
[null,null,null,null," ",null,null,0]
[null,null,null,null," ",null,null,0]
[null,null,null,null," ",null,null,0]
[null,null,null,null," ",null,null,0]
[null,null,null,null," ",null,null,0]
[null,null,null,null," ",null,null,0]
[null,null,null,null," ",null,null,0]
[null,null,null,null," ",null,null,0]
[null,null,null,null," ",null,null,0]
[null,null,null,null," ",null,null,0]
[null,null,null,null," ",null,null,0]
[null,null,null,null," ",null,null,0]
[null,null,null,null," ",null,null,0]
[null,null,null,null," ",null,null,0]
[null,null,null,null," ",null,null,0]
[null,null,null,null,{"$f":"IF(D265>0,VLOOKUP(D265,entidades,2,FALSE),\" \")","v":" "},null,null,{"$f":"+F265+G265","v":0}]
[null,null,null,null," ",null,null,0]
[null,null,null,null," ",null,null,0]
[null,null,null,null," ",null,null,0]
[null,null,null,null," ",null,null,0]
[null,null,null,null," ",null,null,0]
[null,null,null,null," ",null,null,0]
[null,null,null,null," ",null,null,0]
[null,null,null,null," ",null,null,0]
[null,null,null,null," ",null,null,0]
[null,null,null,null," ",null,null,0]
[null,null,null,null," ",null,null,0]
[null,null,null,null," ",null,null,0]
[null,null,null,null," ",null,null,0]
[null,null,null,null," ",null,null,0]
[null,null,null,null," ",null,null,0]
[null,null,null,null," ",null,null,0]
[null,null,null,null," ",null,null,0]
[null,null,null,null," ",null,null,0]
[null,null,null,null," ",null,null,0]
[null,null,null,null," ",null,null,0]
[null,null,null,null," ",null,null,0]
[null,null,null,null," ",null,null,0]
[null,null,null,null," ",null,null,0]
[null,null,null,null," ",null,null,0]
[null,null,null,null," ",null,null,0]
[null,null,null,null," ",null,null,0]
[null,null,null,null," ",null,null,0]
[null,null,null,null," ",null,null,0]
[null,null,null,null," ",null,null,0]
[null,null,null,null," ",null,null,0]
[null,null,null,null," ",null,null,0]
[null,null,null,null," ",null,null,0]
[null,null,null,null," ",null,null,0]
[null,null,null,null," ",null,null,0]
[null,null,null,null," ",null,null,0]
[null,null,null,null," ",null,null,0]
[null,null,null,null," ",null,null,0]
[null,null,null,null," ",null,null,0]
[null,null,null,null," ",null,null,0]
[null,null,null,null," ",null,null,0]
[null,null,null,null," ",null,null,0]
[null,null,null,null," ",null,null,0]
[null,null,null,null," ",null,null,0]
[null,null,null,null," ",null,null,0]
[null,null,null,null," ",null,null,0]
[null,null,null,null," ",null,null,0]
[null,null,null,null," ",null,null,0]
[null,null,null,null," ",null,null,0]
[null,null,null,null," ",null,null,0]
[null,null,null,null," ",null,null,0]
[null,null,null,null," ",null,null,0]
[null,null,null,null," ",null,null,0]
[null,null,null,null," ",null,null,0]
[null,null,null,null," ",null,null,0]
[null,null,null,null," ",null,null,0]
[null,null,null,null," ",null,null,0]
[null,null,null,null," ",null,null,0]
[null,null,null,null," ",null,null,0]
[null,null,null,null," ",null,null,0]
[null,null,null,null," ",null,null,0]
[null,null,null,null," ",null,null,0]
[null,null,null,null," ",null,null,0]
[null,null,null,null," ",null,null,0]
[null,null,null,null,{"$f":"IF(D329>0,VLOOKUP(D329,entidades,2,FALSE),\" \")","v":" "},null,null,{"$f":"+F329+G329","v":0}]
[null,null,null,null," ",null,null,0]
[null,null,null,null," ",null,null,0]
[null,null,null,null," ",null,null,0]
[null,null,null,null," ",null,null,0]
[null,null,null,null," ",null,null,0]
[null,null,null,null," ",null,null,0]
[null,null,null,null," ",null,null,0]
[null,null,null,null," ",null,null,0]
[null,null,null,null," ",null,null,0]
[null,null,null,null," ",null,null,0]
[null,null,null,null," ",null,null,0]
[null,null,null,null," ",null,null,0]
[null,null,null,null," ",null,null,0]
[null,null,null,null," ",null,null,0]
[null,null,null,null," ",null,null,0]
[null,null,null,null," ",null,null,0]
[null,null,null,null," ",null,null,0]
[null,null,null,null," ",null,null,0]
[null,null,null,null," ",null,null,0]
[null,null,null,null," ",null,null,0]
[null,null,null,null," ",null,null,0]
[null,null,null,null," ",null,null,0]
[null,null,null,null," ",null,null,0]
[null,null,null,null," ",null,null,0]
[null,null,null,null," ",null,null,0]
[null,null,null,null," ",null,null,0]
[null,null,null,null," ",null,null,0]
[null,null,null,null," ",null,null,0]
[null,null,null,null," ",null,null,0]
[null,null,null,null," ",null,null,0]
[null,null,null,null," ",null,null,0]
[null,null,null,null," ",null,null,0]
[null,null,null,null," ",null,null,0]
[null,null,null,null," ",null,null,0]
[null,null,null,null," ",null,null,0]
[null,null,null,null," ",null,null,0]
[null,null,null,null," ",null,null,0]
[null,null,null,null," ",null,null,0]
[null,null,null,null," ",null,null,0]
[null,null,null,null," ",null,null,0]
[null,null,null,null," ",null,null,0]
[null,null,null,null," ",null,null,0]
[null,null,null,null," ",null,null,0]
[null,null,null,null," ",null,null,0]
[null,null,null,null," ",null,null,0]
[null,null,null,null," ",null,null,0]
[null,null,null,null," ",null,null,0]
[null,null,null,null," ",null,null,0]
[null,null,null,null," ",null,null,0]
[null,null,null,null," ",null,null,0]
[null,null,null,null," ",null,null,0]
[null,null,null,null," ",null,null,0]
[null,null,null,null," ",null,null,0]
[null,null,null,null," ",null,null,0]
[null,null,null,null," ",null,null,0]
[null,null,null,null," ",null,null,0]
[null,null,null,null," ",null,null,0]
[null,null,null,null," ",null,null,0]
[null,null,null,null," ",null,null,0]
[null,null,null,null," ",null,null,0]
[null,null,null,null," ",null,null,0]
[null,null,null,null," ",null,null,0]
[null,null,null,null," ",null,null,0]
[null,null,null,null,{"$f":"IF(D393>0,VLOOKUP(D393,entidades,2,FALSE),\" \")","v":" "},null,null,{"$f":"+F393+G393","v":0}]
[null,null,null,null," ",null,null,0]
[null,null,null,null," ",null,null,0]
[null,null,null,null," ",null,null,0]
[null,null,null,null," ",null,null,0]
[null,null,null,null," ",null,null,0]
[null,null,null,null," ",null,null,0]
[null,null,null,null," ",null,null,0]
[null,null,null,null," ",null,null,0]
[null,null,null,null," ",null,null,0]
[null,null,null,null," ",null,null,0]
[null,null,null,null," ",null,null,0]
[null,null,null,null," ",null,null,0]
[null,null,null,null," ",null,null,0]
[null,null,null,null," ",null,null,0]
[null,null,null,null," ",null,null,0]
[null,null,null,null," ",null,null,0]
[null,null,null,null," ",null,null,0]
[null,null,null,null," ",null,null,0]
[null,null,null,null," ",null,null,0]
[null,null,null,null," ",null,null,0]
[null,null,null,null," ",null,null,0]
[null,null,null,null," ",null,null,0]
[null,null,null,null," ",null,null,0]
[null,null,null,null," ",null,null,0]
[null,null,null,null," ",null,null,0]
[null,null,null,null," ",null,null,0]
[null,null,null,null," ",null,null,0]
[null,null,null,null," ",null,null,0]
[null,null,null,null," ",null,null,0]
[null,null,null,null," ",null,null,0]
[null,null,null,null," ",null,null,0]
[null,null,null,null," ",null,null,0]
[null,null,null,null," ",null,null,0]
[null,null,null,null," ",null,null,0]
[null,null,null,null," ",null,null,0]
[null,null,null,null," ",null,null,0]
[null,null,null,null," ",null,null,0]
[null,null,null,null," ",null,null,0]
[null,null,null,null," ",null,null,0]
[null,null,null,null," ",null,null,0]
[null,null,null,null," ",null,null,0]
[null,null,null,null," ",null,null,0]
[null,null,null,null," ",null,null,0]
[null,null,null,null," ",null,null,0]
[null,null,null,null," ",null,null,0]
[null,null,null,null," ",null,null,0]
[null,null,null,null," ",null,null,0]
[null,null,null,null," ",null,null,0]
[null,null,null,null," ",null,null,0]
[null,null,null,null," ",null,null,0]
[null,null,null,null," ",null,null,0]
[null,null,null,null," ",null,null,0]
[null,null,null,null," ",null,null,0]
[null,null,null,null," ",null,null,0]
[null,null,null,null," ",null,null,0]
[null,null,null,null," ",null,null,0]
[null,null,null,null," ",null,null,0]
[null,null,null,null," ",null,null,0]
[null,null,null,null," ",null,null,0]
[null,null,null,null," ",null,null,0]
[null,null,null,null," ",null,null,0]
[null,null,null,null," ",null,null,0]
[null,null,null,null," ",null,null,0]
[null,null,null,null,{"$f":"IF(D457>0,VLOOKUP(D457,entidades,2,FALSE),\" \")","v":" "},null,null,{"$f":"+F457+G457","v":0}]
[null,null,null,null," ",null,null,0]
[null,null,null,null," ",null,null,0]
[null,null,null,null," ",null,null,0]
[null,null,null,null," ",null,null,0]
[null,null,null,null," ",null,null,0]
[null,null,null,null," ",null,null,0]
[null,null,null,null," ",null,null,0]
[null,null,null,null," ",null,null,0]
[null,null,null,null," ",null,null,0]
[null,null,null,null," ",null,null,0]
[null,null,null,null," ",null,null,0]
[null,null,null,null," ",null,null,0]
[null,null,null,null," ",null,null,0]
[null,null,null,null," ",null,null,0]
[null,null,null,null," ",null,null,0]
[null,null,null,null," ",null,null,0]
[null,null,null,null," ",null,null,0]
[null,null,null,null," ",null,null,0]
[null,null,null,null," ",null,null,0]
[null,null,null,null," ",null,null,0]
[null,null,null,null," ",null,null,0]
[null,null,null,null," ",null,null,0]
[null,null,null,null," ",null,null,0]
[null,null,null,null," ",null,null,0]
[null,null,null,null," ",null,null,0]
[null,null,null,null," ",null,null,0]
[null,null,null,null," ",null,null,0]
[null,null,null,null," ",null,null,0]
[null,null,null,null," ",null,null,0]
[null,null,null,null," ",null,null,0]
[null,null,null,null," ",null,null,0]
[null,null,null,null," ",null,null,0]
[null,null,null,null," ",null,null,0]
[null,null,null,null," ",null,null,0]
[null,null,null,null," ",null,null,0]
[null,null,null,null," ",null,null,0]
[null,null,null,null," ",null,null,0]
[null,null,null,null," ",null,null,0]
[null,null,null,null," ",null,null,0]
[null,null,null,null," ",null,null,0]
[null,null,null,null," ",null,null,0]
[null,null,null,null," ",null,null,0]
[null,null,null,null," ",null,null,0]
[null,null,null,null," ",null,null,0]
[null,null,null,null," ",null,null,0]
[null,null,null,null," ",null,null,0]
[null,null,null,null," ",null,null,0]
[null,null,null,null," ",null,null,0]
[null,null,null,null," ",null,null,0]
[null,null,null,null," ",null,null,0]
[null,null,null,null," ",null,null,0]
[null,null,null,null," ",null,null,0]
[null,null,null,null," ",null,null,0]
[null,null,null,null," ",null,null,0]
[null,null,null,null," ",null,null,0]
[null,null,null,null," ",null,null,0]
[null,null,null,null," ",null,null,0]
[null,null,null,null," ",null,null,0]
[null,null,null,null," ",null,null,0]
[null,null,null,null," ",null,null,0]
[null,null,null,null," ",null,null,0]
[null,null,null,null," ",null,null,0]
[null,null,null,null," ",null,null,0]
[null,null,null,null,{"$f":"IF(D521>0,VLOOKUP(D521,entidades,2,FALSE),\" \")","v":" "},null,null,{"$f":"+F521+G521","v":0}]
[null,null,null,null," ",null,null,0]
[null,null,null,null," ",null,null,0]
[null,null,null,null," ",null,null,0]
[null,null,null,null," ",null,null,0]
[null,null,null,null," ",null,null,0]
[null,null,null,null," ",null,null,0]
[null,null,null,null," ",null,null,0]
[null,null,null,null," ",null,null,0]
[null,null,null,null," ",null,null,0]
[null,null,null,null," ",null,null,0]
[null,null,null,null," ",null,null,0]
[null,null,null,null," ",null,null,0]
[null,null,null,null," ",null,null,0]
[null,null,null,null," ",null,null,0]
[null,null,null,null," ",null,null,0]
[null,null,null,null," ",null,null,0]
[null,null,null,null," ",null,null,0]
[null,null,null,null," ",null,null,0]
[null,null,null,null," ",null,null,0]
[null,null,null,null," ",null,null,0]
[null,null,null,null," ",null,null,0]
[null,null,null,null," ",null,null,0]
[null,null,null,null," ",null,null,0]
[null,null,null,null," ",null,null,0]
[null,null,null,null," ",null,null,0]
[null,null,null,null," ",null,null,0]
[null,null,null,null," ",null,null,0]
[null,null,null,null," ",null,null,0]
[null,null,null,null," ",null,null,0]
[null,null,null,null," ",null,null,0]
[null,null,null,null," ",null,null,0]
[null,null,null,null," ",null,null,0]
[null,null,null,null," ",null,null,0]
[null,null,null,null," ",null,null,0]
[null,null,null,null," ",null,null,0]
[null,null,null,null," ",null,null,0]
[null,null,null,null," ",null,null,0]
[null,null,null,null," ",null,null,0]
[null,null,null,null," ",null,null,0]
[null,null,null,null," ",null,null,0]
[null,null,null,null," ",null,null,0]
[null,null,null,null," ",null,null,0]
[null,null,null,null," ",null,null,0]
[null,null,null,null," ",null,null,0]
[null,null,null,null," ",null,null,0]
[null,null,null,null," ",null,null,0]
[null,null,null,null," ",null,null,0]
[null,null,null,null," ",null,null,0]
[null,null,null,null," ",null,null,0]
[null,null,null,null," ",null,null,0]
[null,null,null,null," ",null,null,0]
[null,null,null,null," ",null,null,0]
[null,null,null,null," ",null,null,0]
[null,null,null,null," ",null,null,0]
[null,null,null,null," ",null,null,0]
[null,null,null,null," ",null,null,0]
[null,null,null,null," ",null,null,0]
[null,null,null,null," ",null,null,0]
[null,null,null,null," ",null,null,0]
[null,null,null,null," ",null,null,0]
[null,null,null,null," ",null,null,0]
[null,null,null,null," ",null,null,0]
[null,null,null,null," ",null,null,0]
[null,null,null,null,{"$f":"IF(D585>0,VLOOKUP(D585,entidades,2,FALSE),\" \")","v":" "},null,null,{"$f":"+F585+G585","v":0}]
[null,null,null,null," ",null,null,0]
[null,null,null,null," ",null,null,0]
[null,null,null,null," ",null,null,0]
[null,null,null,null," ",null,null,0]
[null,null,null,null," ",null,null,0]
[null,null,null,null," ",null,null,0]
[null,null,null,null," ",null,null,0]
[null,null,null,null," ",null,null,0]
[null,null,null,null," ",null,null,0]
[null,null,null,null," ",null,null,0]
[null,null,null,null," ",null,null,0]
[null,null,null,null," ",null,null,0]
[null,null,null,null," ",null,null,0]
[null,null,null,null," ",null,null,0]
[null,null,null,null," ",null,null,0]
[null,null,null,null," ",null,null,0]
[null,null,null,null," ",null,null,0]
[null,null,null,null," ",null,null,0]
[null,null,null,null," ",null,null,0]
[null,null,null,null," ",null,null,0]
[null,null,null,null," ",null,null,0]
[null,null,null,null," ",null,null,0]
[null,null,null,null," ",null,null,0]
[null,null,null,null," ",null,null,0]
[null,null,null,null," ",null,null,0]
[null,null,null,null," ",null,null,0]
[null,null,null,null," ",null,null,0]
[null,null,null,null," ",null,null,0]
[null,null,null,null," ",null,null,0]
[null,null,null,null," ",null,null,0]
[null,null,null,null," ",null,null,0]
[null,null,null,null," ",null,null,0]
[null,null,null,null," ",null,null,0]
[null,null,null,null," ",null,null,0]
[null,null,null,null," ",null,null,0]
[null,null,null,null," ",null,null,0]
[null,null,null,null," ",null,null,0]
[null,null,null,null," ",null,null,0]
[null,null,null,null," ",null,null,0]
[null,null,null,null," ",null,null,0]
[null,null,null,null," ",null,null,0]
[null,null,null,null," ",null,null,0]
[null,null,null,null," ",null,null,0]
[null,null,null,null," ",null,null,0]
[null,null,null,null," ",null,null,0]
[null,null,null,null," ",null,null,0]
[null,null,null,null," ",null,null,0]
[null,null,null,null," ",null,null,0]
[null,null,null,null," ",null,null,0]
[null,null,null,null," ",null,null,0]
[null,null,null,null," ",null,null,0]
[null,null,null,null," ",null,null,0]
[null,null,null,null," ",null,null,0]
[null,null,null,null," ",null,null,0]
[null,null,null,null," ",null,null,0]
[null,null,null,null," ",null,null,0]
[null,null,null,null," ",null,null,0]
[null,null,null,null," ",null,null,0]
[null,null,null,null," ",null,null,0]
[null,null,null,null," ",null,null,0]
[null,null,null,null," ",null,null,0]
[null,null,null,null," ",null,null,0]
[null,null,null,null," ",null,null,0]
[null,null,null,null,{"$f":"IF(D649>0,VLOOKUP(D649,entidades,2,FALSE),\" \")","v":" "},null,null,{"$f":"+F649+G649","v":0}]
[null,null,null,null," ",null,null,0]
[null,null,null,null," ",null,null,0]
[null,null,null,null," ",null,null,0]
[null,null,null,null," ",null,null,0]
[null,null,null,null," ",null,null,0]
[null,null,null,null," ",null,null,0]
[null,null,null,null," ",null,null,0]
[null,null,null,null," ",null,null,0]
[null,null,null,null," ",null,null,0]
[null,null,null,null," ",null,null,0]
[null,null,null,null," ",null,null,0]
[null,null,null,null," ",null,null,0]
[null,null,null,null," ",null,null,0]
[null,null,null,null," ",null,null,0]
[null,null,null,null," ",null,null,0]
[null,null,null,null," ",null,null,0]
[null,null,null,null," ",null,null,0]
[null,null,null,null," ",null,null,0]
[null,null,null,null," ",null,null,0]
[null,null,null,null," ",null,null,0]
[null,null,null,null," ",null,null,0]
[null,null,null,null," ",null,null,0]
[null,null,null,null," ",null,null,0]
[null,null,null,null," ",null,null,0]
[null,null,null,null," ",null,null,0]
[null,null,null,null," ",null,null,0]
[null,null,null,null," ",null,null,0]
[null,null,null,null," ",null,null,0]
[null,null,null,null," ",null,null,0]
[null,null,null,null," ",null,null,0]
[null,null,null,null," ",null,null,0]
[null,null,null,null," ",null,null,0]
[null,null,null,null," ",null,null,0]
[null,null,null,null," ",null,null,0]
[null,null,null,null," ",null,null,0]
[null,null,null,null," ",null,null,0]
[null,null,null,null," ",null,null,0]
[null,null,null,null," ",null,null,0]
[null,null,null,null," ",null,null,0]
[null,null,null,null," ",null,null,0]
[null,null,null,null," ",null,null,0]
[null,null,null,null," ",null,null,0]
[null,null,null,null," ",null,null,0]
[null,null,null,null," ",null,null,0]
[null,null,null,null," ",null,null,0]
[null,null,null,null," ",null,null,0]
[null,null,null,null," ",null,null,0]
[null,null,null,null," ",null,null,0]
[null,null,null,null," ",null,null,0]
[null,null,null,null," ",null,null,0]
[null,null,null,null," ",null,null,0]
[null,null,null,null," ",null,null,0]
[null,null,null,null," ",null,null,0]
[null,null,null,null," ",null,null,0]
[null,null,null,null," ",null,null,0]
[null,null,null,null," ",null,null,0]
[null,null,null,null," ",null,null,0]
[null,null,null,null," ",null,null,0]
[null,null,null,null," ",null,null,0]
[null,null,null,null," ",null,null,0]
[null,null,null,null," ",null,null,0]
[null,null,null,null," ",null,null,0]
[null,null,null,null," ",null,null,0]
[null,null,null,null,{"$f":"IF(D713>0,VLOOKUP(D713,entidades,2,FALSE),\" \")","v":" "},null,null,{"$f":"+F713+G713","v":0}]
[null,null,null,null," ",null,null,0]
[null,null,null,null," ",null,null,0]
[null,null,null,null," ",null,null,0]
[null,null,null,null," ",null,null,0]
[null,null,null,null," ",null,null,0]
[null,null,null,null," ",null,null,0]
[null,null,null,null," ",null,null,0]
[null,null,null,null," ",null,null,0]
[null,null,null,null," ",null,null,0]
[null,null,null,null," ",null,null,0]
[null,null,null,null," ",null,null,0]
[null,null,null,null," ",null,null,0]
[null,null,null,null," ",null,null,0]
[null,null,null,null," ",null,null,0]
[null,null,null,null," ",null,null,0]
[null,null,null,null," ",null,null,0]
[null,null,null,null," ",null,null,0]
[null,null,null,null," ",null,null,0]
[null,null,null,null," ",null,null,0]
[null,null,null,null," ",null,null,0]
[null,null,null,null," ",null,null,0]
[null,null,null,null," ",null,null,0]
[null,null,null,null," ",null,null,0]
[null,null,null,null," ",null,null,0]
[null,null,null,null," ",null,null,0]
[null,null,null,null," ",null,null,0]
[null,null,null,null," ",null,null,0]
[null,null,null,null," ",null,null,0]
[null,null,null,null," ",null,null,0]
[null,null,null,null," ",null,null,0]
[null,null,null,null," ",null,null,0]
[null,null,null,null," ",null,null,0]
[null,null,null,null," ",null,null,0]
[null,null,null,null," ",null,null,0]
[null,null,null,null," ",null,null,0]
[null,null,null,null," ",null,null,0]
[null,null,null,null," ",null,null,0]
[null,null,null,null," ",null,null,0]
[null,null,null,null," ",null,null,0]
[null,null,null,null," ",null,null,0]
[null,null,null,null," ",null,null,0]
[null,null,null,null," ",null,null,0]
[null,null,null,null," ",null,null,0]
[null,null,null,null," ",null,null,0]
[null,null,null,null," ",null,null,0]
[null,null,null,null," ",null,null,0]
[null,null,null,null," ",null,null,0]
[null,null,null,null," ",null,null,0]
[null,null,null,null," ",null,null,0]
[null,null,null,null," ",null,null,0]
[null,null,null,null," ",null,null,0]
[null,null,null,null," ",null,null,0]
[null,null,null,null," ",null,null,0]
[null,null,null,null," ",null,null,0]
[null,null,null,null," ",null,null,0]
[null,null,null,null," ",null,null,0]
[null,null,null,null," ",null,null,0]
[null,null,null,null," ",null,null,0]
[null,null,null,null," ",null,null,0]
[null,null,null,null," ",null,null,0]
[null,null,null,null," ",null,null,0]
[null,null,null,null," ",null,null,0]
[null,null,null,null," ",null,null,0]
[null,null,null,null,{"$f":"IF(D777>0,VLOOKUP(D777,entidades,2,FALSE),\" \")","v":" "},null,null,{"$f":"+F777+G777","v":0}]
[null,null,null,null," ",null,null,0]
[null,null,null,null," ",null,null,0]
[null,null,null,null," ",null,null,0]
[null,null,null,null," ",null,null,0]
[null,null,null,null," ",null,null,0]
[null,null,null,null," ",null,null,0]
[null,null,null,null," ",null,null,0]
[null,null,null,null," ",null,null,0]
[null,null,null,null," ",null,null,0]
[null,null,null,null," ",null,null,0]
[null,null,null,null," ",null,null,0]
[null,null,null,null," ",null,null,0]
[null,null,null,null," ",null,null,0]
[null,null,null,null," ",null,null,0]
[null,null,null,null," ",null,null,0]
[null,null,null,null," ",null,null,0]
[null,null,null,null," ",null,null,0]
[null,null,null,null," ",null,null,0]
[null,null,null,null," ",null,null,0]
[null,null,null,null," ",null,null,0]
[null,null,null,null," ",null,null,0]
[null,null,null,null," ",null,null,0]
[null,null,null,null," ",null,null,0]
[null,null,null,null," ",null,null,0]
[null,null,null,null," ",null,null,0]
[null,null,null,null," ",null,null,0]
[null,null,null,null," ",null,null,0]
[null,null,null,null," ",null,null,0]
[null,null,null,null," ",null,null,0]
[null,null,null,null," ",null,null,0]
[null,null,null,null," ",null,null,0]
[null,null,null,null," ",null,null,0]
[null,null,null,null," ",null,null,0]
[null,null,null,null," ",null,null,0]
[null,null,null,null," ",null,null,0]
[null,null,null,null," ",null,null,0]
[null,null,null,null," ",null,null,0]
[null,null,null,null," ",null,null,0]
[null,null,null,null," ",null,null,0]
[null,null,null,null," ",null,null,0]
[null,null,null,null," ",null,null,0]
[null,null,null,null," ",null,null,0]
[null,null,null,null," ",null,null,0]
[null,null,null,null," ",null,null,0]
[null,null,null,null," ",null,null,0]
[null,null,null,null," ",null,null,0]
[null,null,null,null," ",null,null,0]
[null,null,null,null," ",null,null,0]
[null,null,null,null," ",null,null,0]
[null,null,null,null," ",null,null,0]
[null,null,null,null," ",null,null,0]
[null,null,null,null," ",null,null,0]
[null,null,null,null," ",null,null,0]
[null,null,null,null," ",null,null,0]
[null,null,null,null," ",null,null,0]
[null,null,null,null," ",null,null,0]
[null,null,null,null," ",null,null,0]
[null,null,null,null," ",null,null,0]
[null,null,null,null," ",null,null,0]
[null,null,null,null," ",null,null,0]
[null,null,null,null," ",null,null,0]
[null,null,null,null," ",null,null,0]
[null,null,null,null," ",null,null,0]
[null,null,null,null,{"$f":"IF(D841>0,VLOOKUP(D841,entidades,2,FALSE),\" \")","v":" "},null,null,{"$f":"+F841+G841","v":0}]
[null,null,null,null," ",null,null,0]
[null,null,null,null," ",null,null,0]
[null,null,null,null," ",null,null,0]
[null,null,null,null," ",null,null,0]
[null,null,null,null," ",null,null,0]
[null,null,null,null," ",null,null,0]
[null,null,null,null," ",null,null,0]
[null,null,null,null," ",null,null,0]
[null,null,null,null," ",null,null,0]
[null,null,null,null," ",null,null,0]
[null,null,null,null," ",null,null,0]
[null,null,null,null," ",null,null,0]
[null,null,null,null," ",null,null,0]
[null,null,null,null," ",null,null,0]
[null,null,null,null," ",null,null,0]
[null,null,null,null," ",null,null,0]
[null,null,null,null," ",null,null,0]
[null,null,null,null," ",null,null,0]
[null,null,null,null," ",null,null,0]
[null,null,null,null," ",null,null,0]
[null,null,null,null," ",null,null,0]
[null,null,null,null," ",null,null,0]
[null,null,null,null," ",null,null,0]
[null,null,null,null," ",null,null,0]
[null,null,null,null," ",null,null,0]
[null,null,null,null," ",null,null,0]
[null,null,null,null," ",null,null,0]
[null,null,null,null," ",null,null,0]
[null,null,null,null," ",null,null,0]
[null,null,null,null," ",null,null,0]
[null,null,null,null," ",null,null,0]
[null,null,null,null," ",null,null,0]
[null,null,null,null," ",null,null,0]
[null,null,null,null," ",null,null,0]
[null,null,null,null," ",null,null,0]
[null,null,null,null," ",null,null,0]
[null,null,null,null," ",null,null,0]
[null,null,null,null," ",null,null,0]
[null,null,null,null," ",null,null,0]
[null,null,null,null," ",null,null,0]
[null,null,null,null," ",null,null,0]
[null,null,null,null," ",null,null,0]
[null,null,null,null," ",null,null,0]
[null,null,null,null," ",null,null,0]
[null,null,null,null," ",null,null,0]
[null,null,null,null," ",null,null,0]
[null,null,null,null," ",null,null,0]
[null,null,null,null," ",null,null,0]
[null,null,null,null," ",null,null,0]
[null,null,null,null," ",null,null,0]
[null,null,null,null," ",null,null,0]
[null,null,null,null," ",null,null,0]
[null,null,null,null," ",null,null,0]
[null,null,null,null," ",null,null,0]
[null,null,null,null," ",null,null,0]
[null,null,null,null," ",null,null,0]
[null,null,null,null," ",null,null,0]
[null,null,null,null," ",null,null,0]
[null,null,null,null," ",null,null,0]
[null,null,null,null," ",null,null,0]
[null,null,null,null," ",null,null,0]
[null,null,null,null," ",null,null,0]
[null,null,null,null," ",null,null,0]
[null,null,null,null,{"$f":"IF(D905>0,VLOOKUP(D905,entidades,2,FALSE),\" \")","v":" "},null,null,{"$f":"+F905+G905","v":0}]
[null,null,null,null," ",null,null,0]
[null,null,null,null," ",null,null,0]
[null,null,null,null," ",null,null,0]
[null,null,null,null," ",null,null,0]
[null,null,null,null," ",null,null,0]
[null,null,null,null," ",null,null,0]
[null,null,null,null," ",null,null,0]
[null,null,null,null," ",null,null,0]
[null,null,null,null," ",null,null,0]
[null,null,null,null," ",null,null,0]
[null,null,null,null," ",null,null,0]
[null,null,null,null," ",null,null,0]
[null,null,null,null," ",null,null,0]
[null,null,null,null," ",null,null,0]
[null,null,null,null," ",null,null,0]
[null,null,null,null," ",null,null,0]
[null,null,null,null," ",null,null,0]
[null,null,null,null," ",null,null,0]
[null,null,null,null," ",null,null,0]
[null,null,null,null," ",null,null,0]
[null,null,null,null," ",null,null,0]
[null,null,null,null," ",null,null,0]
[null,null,null,null," ",null,null,0]
[null,null,null,null," ",null,null,0]
[null,null,null,null," ",null,null,0]
[null,null,null,null," ",null,null,0]
[null,null,null,null," ",null,null,0]
[null,null,null,null," ",null,null,0]
[null,null,null,null," ",null,null,0]
[null,null,null,null," ",null,null,0]
[null,null,null,null," ",null,null,0]
[null,null,null,null," ",null,null,0]
[null,null,null,null," ",null,null,0]
[null,null,null,null," ",null,null,0]
[null,null,null,null," ",null,null,0]
[null,null,null,null," ",null,null,0]
[null,null,null,null," ",null,null,0]
[null,null,null,null," ",null,null,0]
[null,null,null,null," ",null,null,0]
[null,null,null,null," ",null,null,0]
[null,null,null,null," ",null,null,0]
[null,null,null,null," ",null,null,0]
[null,null,null,null," ",null,null,0]
[null,null,null,null," ",null,null,0]
[null,null,null,null," ",null,null,0]
[null,null,null,null," ",null,null,0]
[null,null,null,null," ",null,null,0]
[null,null,null,null," ",null,null,0]
[null,null,null,null," ",null,null,0]
[null,null,null,null," ",null,null,0]
[null,null,null,null," ",null,null,0]
[null,null,null,null," ",null,null,0]
[null,null,null,null," ",null,null,0]
[null,null,null,null," ",null,null,0]
[null,null,null,null," ",null,null,0]
[null,null,null,null," ",null,null,0]
[null,null,null,null," ",null,null,0]
[null,null,null,null," ",null,null,0]
[null,null,null,null," ",null,null,0]
[null,null,null,null," ",null,null,0]
[null,null,null,null," ",null,null,0]
[null,null,null,null," ",null,null,0]
[null,null,null,null," ",null,null,0]
[null,null,null,null,{"$f":"IF(D969>0,VLOOKUP(D969,entidades,2,FALSE),\" \")","v":" "},null,null,{"$f":"+F969+G969","v":0}]
[null,null,null,null," ",null,null,0]
[null,null,null,null," ",null,null,0]
[null,null,null,null," ",null,null,0]
[null,null,null,null," ",null,null,0]
[null,null,null,null," ",null,null,0]
[null,null,null,null," ",null,null,0]
[null,null,null,null," ",null,null,0]
[null,null,null,null," ",null,null,0]
[null,null,null,null," ",null,null,0]
[null,null,null,null," ",null,null,0]
[null,null,null,null," ",null,null,0]
[null,null,null,null," ",null,null,0]
[null,null,null,null," ",null,null,0]
[null,null,null,null," ",null,null,0]
[null,null,null,null," ",null,null,0]
[null,null,null,null," ",null,null,0]
[null,null,null,null," ",null,null,0]
[null,null,null,null," ",null,null,0]
[null,null,null,null," ",null,null,0]
[null,null,null,null," ",null,null,0]
[null,null,null,null," ",null,null,0]
[null,null,null,null," ",null,null,0]
[null,null,null,null," ",null,null,0]
[null,null,null,null," ",null,null,0]
[null,null,null,null," ",null,null,0]
[null,null,null,null," ",null,null,0]
[null,null,null,null," ",null,null,0]
[null,null,null,null," ",null,null,0]
[null,null,null,null," ",null,null,0]
[null,null,null,null," ",null,null,0]
[null,null,null,null," ",null,null,0]
[null,null,null,null," ",null,null,0]
[null,null,null,null," ",null,null,0]
[null,null,null,null," ",null,null,0]
[null,null,null,null," ",null,null,0]
[null,null,null,null," ",null,null,0]
[null,null,null,null," ",null,null,0]
[null,null,null,null," ",null,null,0]
[null,null,null,null," ",null,null,0]
[null,null,null,null," ",null,null,0]
[null,null,null,null," ",null,null,0]
[null,null,null,null," ",null,null,0]
[null,null,null,null," ",null,null,0]
[null,null,null,null," ",null,null,0]
[null,null,null,null," ",null,null,0]
[null,null,null,null," ",null,null,0]
[null,null,null,null," ",null,null,0]
[null,null,null,null," ",null,null,0]
[null,null,null,null," ",null,null,0]
[null,null,null,null," ",null,null,0]
[null,null,null,null," ",null,null,0]
[null,null,null,null," ",null,null,0]
[null,null,null,null," ",null,null,0]
[null,null,null,null," ",null,null,0]
[null,null,null,null," ",null,null,0]
[null,null,null,null," ",null,null,0]
[null,null,null,null," ",null,null,0]
[null,null,null,null," ",null,null,0]
[null,null,null,null," ",null,null,0]
[null,null,null,null," ",null,null,0]
[null,null,null,null," ",null,null,0]
[null,null,null,null," ",null,null,0]
[null,null,null,null," ",null,null,0]
[null,null,null,null,{"$f":"IF(D1033>0,VLOOKUP(D1033,entidades,2,FALSE),\" \")","v":" "},null,null,{"$f":"+F1033+G1033","v":0}]
[null,null,null,null," ",null,null,0]
[null,null,null,null," ",null,null,0]
[null,null,null,null," ",null,null,0]
[null,null,null,null," ",null,null,0]
[null,null,null,null," ",null,null,0]
[null,null,null,null," ",null,null,0]
[null,null,null,null," ",null,null,0]
[null,null,null,null," ",null,null,0]
[null,null,null,null," ",null,null,0]
[null,null,null,null," ",null,null,0]
[null,null,null,null," ",null,null,0]
[null,null,null,null," ",null,null,0]
[null,null,null,null," ",null,null,0]
[null,null,null,null," ",null,null,0]
[null,null,null,null," ",null,null,0]
[null,null,null,null," ",null,null,0]
[null,null,null,null," ",null,null,0]
[null,null,null,null," ",null,null,0]
[null,null,null,null," ",null,null,0]
[null,null,null,null," ",null,null,0]
[null,null,null,null," ",null,null,0]
[null,null,null,null," ",null,null,0]
[null,null,null,null," ",null,null,0]
[null,null,null,null," ",null,null,0]
[null,null,null,null," ",null,null,0]
[null,null,null,null," ",null,null,0]
[null,null,null,null," ",null,null,0]
[null,null,null,null," ",null,null,0]
[null,null,null,null," ",null,null,0]
[null,null,null,null," ",null,null,0]
[null,null,null,null," ",null,null,0]
[null,null,null,null," ",null,null,0]
[null,null,null,null," ",null,null,0]
[null,null,null,null," ",null,null,0]
[null,null,null,null," ",null,null,0]
[null,null,null,null," ",null,null,0]
[null,null,null,null," ",null,null,0]
[null,null,null,null," ",null,null,0]
[null,null,null,null," ",null,null,0]
[null,null,null,null," ",null,null,0]
[null,null,null,null," ",null,null,0]
[null,null,null,null," ",null,null,0]
[null,null,null,null," ",null,null,0]
[null,null,null,null," ",null,null,0]
[null,null,null,null," ",null,null,0]
[null,null,null,null," ",null,null,0]
[null,null,null,null," ",null,null,0]
[null,null,null,null," ",null,null,0]
[null,null,null,null," ",null,null,0]
[null,null,null,null," ",null,null,0]
[null,null,null,null," ",null,null,0]
[null,null,null,null," ",null,null,0]
[null,null,null,null," ",null,null,0]
[null,null,null,null," ",null,null,0]
[null,null,null,null," ",null,null,0]
[null,null,null,null," ",null,null,0]
[null,null,null,null," ",null,null,0]
[null,null,null,null," ",null,null,0]
[null,null,null,null," ",null,null,0]
[null,null,null,null," ",null,null,0]
[null,null,null,null," ",null,null,0]
[null,null,null,null," ",null,null,0]
[null,null,null,null," ",null,null,0]
[null,null,null,null,{"$f":"IF(D1097>0,VLOOKUP(D1097,entidades,2,FALSE),\" \")","v":" "},null,null,{"$f":"+F1097+G1097","v":0}]
[null,null,null,null," ",null,null,0]
[null,null,null,null," ",null,null,0]
[null,null,null,null," ",null,null,0]
[null,null,null,null," ",null,null,0]
[null,null,null,null," ",null,null,0]
[null,null,null,null," ",null,null,0]
[null,null,null,null," ",null,null,0]
[null,null,null,null," ",null,null,0]
[null,null,null,null," ",null,null,0]
[null,null,null,null," ",null,null,0]
[null,null,null,null," ",null,null,0]
[null,null,null,null," ",null,null,0]
[null,null,null,null," ",null,null,0]
[null,null,null,null," ",null,null,0]
[null,null,null,null," ",null,null,0]
[null,null,null,null," ",null,null,0]
[null,null,null,null," ",null,null,0]
[null,null,null,null," ",null,null,0]
[null,null,null,null," ",null,null,0]
[null,null,null,null," ",null,null,0]
[null,null,null,null," ",null,null,0]
[null,null,null,null," ",null,null,0]
[null,null,null,null," ",null,null,0]
[null,null,null,null," ",null,null,0]
[null,null,null,null," ",null,null,0]
[null,null,null,null," ",null,null,0]
[null,null,null,null," ",null,null,0]
[null,null,null,null," ",null,null,0]
[null,null,null,null," ",null,null,0]
[null,null,null,null," ",null,null,0]
[null,null,null,null," ",null,null,0]
[null,null,null,null," ",null,null,0]
[null,null,null,null," ",null,null,0]
[null,null,null,null," ",null,null,0]
[null,null,null,null," ",null,null,0]
[null,null,null,null," ",null,null,0]
[null,null,null,null," ",null,null,0]
[null,null,null,null," ",null,null,0]
[null,null,null,null," ",null,null,0]
[null,null,null,null," ",null,null,0]
[null,null,null,null," ",null,null,0]
[null,null,null,null," ",null,null,0]
[null,null,null,null," ",null,null,0]
[null,null,null,null," ",null,null,0]
[null,null,null,null," ",null,null,0]
[null,null,null,null," ",null,null,0]
[null,null,null,null," ",null,null,0]
[null,null,null,null," ",null,null,0]
[null,null,null,null," ",null,null,0]
[null,null,null,null," ",null,null,0]
[null,null,null,null," ",null,null,0]
[null,null,null,null," ",null,null,0]
[null,null,null,null," ",null,null,0]
[null,null,null,null," ",null,null,0]
[null,null,null,null," ",null,null,0]
[null,null,null,null," ",null,null,0]
[null,null,null,null," ",null,null,0]
[null,null,null,null," ",null,null,0]
[null,null,null,null," ",null,null,0]
[null,null,null,null," ",null,null,0]
[null,null,null,null," ",null,null,0]
[null,null,null,null," ",null,null,0]
[null,null,null,null," ",null,null,0]
[null,null,null,null,{"$f":"IF(D1161>0,VLOOKUP(D1161,entidades,2,FALSE),\" \")","v":" "},null,null,{"$f":"+F1161+G1161","v":0}]
[null,null,null,null," ",null,null,0]
[null,null,null,null," ",null,null,0]
[null,null,null,null," ",null,null,0]
[null,null,null,null," ",null,null,0]
[null,null,null,null," ",null,null,0]
[null,null,null,null," ",null,null,0]
[null,null,null,null," ",null,null,0]
[null,null,null,null," ",null,null,0]
[null,null,null,null," ",null,null,0]
[null,null,null,null," ",null,null,0]
[null,null,null,null," ",null,null,0]
[null,null,null,null," ",null,null,0]
[null,null,null,null," ",null,null,0]
[null,null,null,null," ",null,null,0]
[null,null,null,null," ",null,null,0]
[null,null,null,null," ",null,null,0]
[null,null,null,null," ",null,null,0]
[null,null,null,null," ",null,null,0]
[null,null,null,null," ",null,null,0]
[null,null,null,null," ",null,null,0]
[null,null,null,null," ",null,null,0]
[null,null,null,null," ",null,null,0]
[null,null,null,null," ",null,null,0]
[null,null,null,null," ",null,null,0]
[null,null,null,null," ",null,null,0]
[null,null,null,null," ",null,null,0]
[null,null,null,null," ",null,null,0]
[null,null,null,null," ",null,null,0]
[null,null,null,null," ",null,null,0]
[null,null,null,null," ",null,null,0]
[null,null,null,null," ",null,null,0]
[null,null,null,null," ",null,null,0]
[null,null,null,null," ",null,null,0]
[null,null,null,null," ",null,null,0]
[null,null,null,null," ",null,null,0]
[null,null,null,null," ",null,null,0]
[null,null,null,null," ",null,null,0]
[null,null,null,null," ",null,null,0]
[null,null,null,null," ",null,null,0]
[null,null,null,null," ",null,null,0]
[null,null,null,null," ",null,null,0]
[null,null,null,null," ",null,null,0]
[null,null,null,null," ",null,null,0]
[null,null,null,null," ",null,null,0]
[null,null,null,null," ",null,null,0]
[null,null,null,null," ",null,null,0]
[null,null,null,null," ",null,null,0]
[null,null,null,null," ",null,null,0]
[null,null,null,null," ",null,null,0]
[null,null,null,null," ",null,null,0]
[null,null,null,null," ",null,null,0]
[null,null,null,null," ",null,null,0]
[null,null,null,null," ",null,null,0]
[null,null,null,null," ",null,null,0]
[null,null,null,null," ",null,null,0]
[null,null,null,null," ",null,null,0]
[null,null,null,null," ",null,null,0]
[null,null,null,null," ",null,null,0]
[null,null,null,null," ",null,null,0]
[null,null,null,null," ",null,null,0]
[null,null,null,null," ",null,null,0]
[null,null,null,null," ",null,null,0]
[null,null,null,null," ",null,null,0]
[null,null,null,null,{"$f":"IF(D1225>0,VLOOKUP(D1225,entidades,2,FALSE),\" \")","v":" "},null,null,{"$f":"+F1225+G1225","v":0}]
[null,null,null,null," ",null,null,0]
[null,null,null,null," ",null,null,0]
[null,null,null,null," ",null,null,0]
[null,null,null,null," ",null,null,0]
[null,null,null,null," ",null,null,0]
[null,null,null,null," ",null,null,0]
[null,null,null,null," ",null,null,0]
[null,null,null,null," ",null,null,0]
[null,null,null,null," ",null,null,0]
[null,null,null,null," ",null,null,0]
[null,null,null,null," ",null,null,0]
[null,null,null,null," ",null,null,0]
[null,null,null,null," ",null,null,0]
[null,null,null,null," ",null,null,0]
[null,null,null,null," ",null,null,0]
[null,null,null,null," ",null,null,0]
[null,null,null,null," ",null,null,0]
[null,null,null,null," ",null,null,0]
[null,null,null,null," ",null,null,0]
[null,null,null,null," ",null,null,0]
[null,null,null,null," ",null,null,0]
[null,null,null,null," ",null,null,0]
[null,null,null,null," ",null,null,0]
[null,null,null,null," ",null,null,0]
[null,null,null,null," ",null,null,0]
[null,null,null,null," ",null,null,0]
[null,null,null,null," ",null,null,0]
[null,null,null,null," ",null,null,0]
[null,null,null,null," ",null,null,0]
[null,null,null,null," ",null,null,0]
[null,null,null,null," ",null,null,0]
[null,null,null,null," ",null,null,0]
[null,null,null,null," ",null,null,0]
[null,null,null,null," ",null,null,0]
[null,null,null,null," ",null,null,0]
[null,null,null,null," ",null,null,0]
[null,null,null,null," ",null,null,0]
[null,null,null,null," ",null,null,0]
[null,null,null,null," ",null,null,0]
[null,null,null,null," ",null,null,0]
[null,null,null,null," ",null,null,0]
[null,null,null,null," ",null,null,0]
[null,null,null,null," ",null,null,0]
[null,null,null,null," ",null,null,0]
[null,null,null,null," ",null,null,0]
[null,null,null,null," ",null,null,0]
[null,null,null,null," ",null,null,0]
[null,null,null,null," ",null,null,0]
[null,null,null,null," ",null,null,0]
[null,null,null,null," ",null,null,0]
[null,null,null,null," ",null,null,0]
[null,null,null,null," ",null,null,0]
[null,null,null,null," ",null,null,0]
[null,null,null,null," ",null,null,0]
[null,null,null,null," ",null,null,0]
[null,null,null,null," ",null,null,0]
[null,null,null,null," ",null,null,0]
[null,null,null,null," ",null,null,0]
[null,null,null,null," ",null,null,0]
[null,null,null,null," ",null,null,0]
[null,null,null,null," ",null,null,0]
[null,null,null,null," ",null,null,0]
[null,null,null,null," ",null,null,0]
[null,null,null,null,{"$f":"IF(D1289>0,VLOOKUP(D1289,entidades,2,FALSE),\" \")","v":" "},null,null,{"$f":"+F1289+G1289","v":0}]
[null,null,null,null," ",null,null,0]
[null,null,null,null," ",null,null,0]
[null,null,null,null," ",null,null,0]
[null,null,null,null," ",null,null,0]
[null,null,null,null," ",null,null,0]
[null,null,null,null," ",null,null,0]
[null,null,null,null," ",null,null,0]
[null,null,null,null," ",null,null,0]
[null,null,null,null," ",null,null,0]
[null,null,null,null," ",null,null,0]
[null,null,null,null," ",null,null,0]
[null,null,null,null," ",null,null,0]
[null,null,null,null," ",null,null,0]
[null,null,null,null," ",null,null,0]
[null,null,null,null," ",null,null,0]
[null,null,null,null," ",null,null,0]
[null,null,null,null," ",null,null,0]
[null,null,null,null," ",null,null,0]
[null,null,null,null," ",null,null,0]
[null,null,null,null," ",null,null,0]
[null,null,null,null," ",null,null,0]
[null,null,null,null," ",null,null,0]
[null,null,null,null," ",null,null,0]
[null,null,null,null," ",null,null,0]
[null,null,null,null," ",null,null,0]
[null,null,null,null," ",null,null,0]
[null,null,null,null," ",null,null,0]
[null,null,null,null," ",null,null,0]
[null,null,null,null," ",null,null,0]
[null,null,null,null," ",null,null,0]
[null,null,null,null," ",null,null,0]
[null,null,null,null," ",null,null,0]
[null,null,null,null," ",null,null,0]
[null,null,null,null," ",null,null,0]
[null,null,null,null," ",null,null,0]
[null,null,null,null," ",null,null,0]
[null,null,null,null," ",null,null,0]
[null,null,null,null," ",null,null,0]
[null,null,null,null," ",null,null,0]
[null,null,null,null," ",null,null,0]
[null,null,null,null," ",null,null,0]
[null,null,null,null," ",null,null,0]
[null,null,null,null," ",null,null,0]
[null,null,null,null," ",null,null,0]
[null,null,null,null," ",null,null,0]
[null,null,null,null," ",null,null,0]
[null,null,null,null," ",null,null,0]
[null,null,null,null," ",null,null,0]
[null,null,null,null," ",null,null,0]
[null,null,null,null," ",null,null,0]
[null,null,null,null," ",null,null,0]
[null,null,null,null," ",null,null,0]
[null,null,null,null," ",null,null,0]
[null,null,null,null," ",null,null,0]
[null,null,null,null," ",null,null,0]
[null,null,null,null," ",null,null,0]
[null,null,null,null," ",null,null,0]
[null,null,null,null," ",null,null,0]
[null,null,null,null," ",null,null,0]
[null,null,null,null," ",null,null,0]
[null,null,null,null," ",null,null,0]
[null,null,null,null," ",null,null,0]
[null,null,null,null," ",null,null,0]
[null,null,null,null,{"$f":"IF(D1353>0,VLOOKUP(D1353,entidades,2,FALSE),\" \")","v":" "},null,null,{"$f":"+F1353+G1353","v":0}]
[null,null,null,null," ",null,null,0]
[null,null,null,null," ",null,null,0]
[null,null,null,null," ",null,null,0]
[null,null,null,null," ",null,null,0]
[null,null,null,null," ",null,null,0]
[null,null,null,null," ",null,null,0]
[null,null,null,null," ",null,null,0]
[null,null,null,null," ",null,null,0]
[null,null,null,null," ",null,null,0]
[null,null,null,null," ",null,null,0]
[null,null,null,null," ",null,null,0]
[null,null,null,null," ",null,null,0]
[null,null,null,null," ",null,null,0]
[null,null,null,null," ",null,null,0]
[null,null,null,null," ",null,null,0]
[null,null,null,null," ",null,null,0]
[null,null,null,null," ",null,null,0]
[null,null,null,null," ",null,null,0]
[null,null,null,null," ",null,null,0]
[null,null,null,null," ",null,null,0]
[null,null,null,null," ",null,null,0]
[null,null,null,null," ",null,null,0]
[null,null,null,null," ",null,null,0]
[null,null,null,null," ",null,null,0]
[null,null,null,null," ",null,null,0]
[null,null,null,null," ",null,null,0]
[null,null,null,null," ",null,null,0]
[null,null,null,null," ",null,null,0]
[null,null,null,null," ",null,null,0]
[null,null,null,null," ",null,null,0]
[null,null,null,null," ",null,null,0]
[null,null,null,null," ",null,null,0]
[null,null,null,null," ",null,null,0]
[null,null,null,null," ",null,null,0]
[null,null,null,null," ",null,null,0]
[null,null,null,null," ",null,null,0]
[null,null,null,null," ",null,null,0]
[null,null,null,null," ",null,null,0]
[null,null,null,null," ",null,null,0]
[null,null,null,null," ",null,null,0]
[null,null,null,null," ",null,null,0]
[null,null,null,null," ",null,null,0]
[null,null,null,null," ",null,null,0]
[null,null,null,null," ",null,null,0]
[null,null,null,null," ",null,null,0]
[null,null,null,null," ",null,null,0]
[null,null,null,null," ",null,null,0]
[null,null,null,null," ",null,null,0]
[null,null,null,null," ",null,null,0]
[null,null,null,null," ",null,null,0]
[null,null,null,null," ",null,null,0]
[null,null,null,null," ",null,null,0]
[null,null,null,null," ",null,null,0]
[null,null,null,null," ",null,null,0]
[null,null,null,null," ",null,null,0]
[null,null,null,null," ",null,null,0]
[null,null,null,null," ",null,null,0]
[null,null,null,null," ",null,null,0]
[null,null,null,null," ",null,null,0]
[null,null,null,null," ",null,null,0]
[null,null,null,null," ",null,null,0]
[null,null,null,null," ",null,null,0]
[null,null,null,null," ",null,null,0]
[null,null,null,null,{"$f":"IF(D1417>0,VLOOKUP(D1417,entidades,2,FALSE),\" \")","v":" "},null,null,{"$f":"+F1417+G1417","v":0}]
[null,null,null,null," ",null,null,0]
[null,null,null,null," ",null,null,0]
[null,null,null,null," ",null,null,0]
[null,null,null,null," ",null,null,0]
[null,null,null,null," ",null,null,0]
[null,null,null,null," ",null,null,0]
[null,null,null,null," ",null,null,0]
[null,null,null,null," ",null,null,0]
[null,null,null,null," ",null,null,0]
[null,null,null,null," ",null,null,0]
[null,null,null,null," ",null,null,0]
[null,null,null,null," ",null,null,0]
[null,null,null,null," ",null,null,0]
[null,null,null,null," ",null,null,0]
[null,null,null,null," ",null,null,0]
[null,null,null,null," ",null,null,0]
[null,null,null,null," ",null,null,0]
[null,null,null,null," ",null,null,0]
[null,null,null,null," ",null,null,0]
[null,null,null,null," ",null,null,0]
[null,null,null,null," ",null,null,0]
[null,null,null,null," ",null,null,0]
[null,null,null,null," ",null,null,0]
[null,null,null,null," ",null,null,0]
[null,null,null,null," ",null,null,0]
[null,null,null,null," ",null,null,0]
[null,null,null,null," ",null,null,0]
[null,null,null,null," ",null,null,0]
[null,null,null,null," ",null,null,0]
[null,null,null,null," ",null,null,0]
[null,null,null,null," ",null,null,0]
[null,null,null,null," ",null,null,0]
[null,null,null,null," ",null,null,0]
[null,null,null,null," ",null,null,0]
[null,null,null,null," ",null,null,0]
[null,null,null,null," ",null,null,0]
[null,null,null,null," ",null,null,0]
[null,null,null,null," ",null,null,0]
[null,null,null,null," ",null,null,0]
[null,null,null,null," ",null,null,0]
[null,null,null,null," ",null,null,0]
[null,null,null,null," ",null,null,0]
[null,null,null,null," ",null,null,0]
[null,null,null,null," ",null,null,0]
[null,null,null,null," ",null,null,0]
[null,null,null,null," ",null,null,0]
[null,null,null,null," ",null,null,0]
[null,null,null,null," ",null,null,0]
[null,null,null,null," ",null,null,0]
[null,null,null,null," ",null,null,0]
[null,null,null,null," ",null,null,0]
[null,null,null,null," ",null,null,0]
[null,null,null,null," ",null,null,0]
[null,null,null,null," ",null,null,0]
[null,null,null,null," ",null,null,0]
[null,null,null,null," ",null,null,0]
[null,null,null,null," ",null,null,0]
[null,null,null,null," ",null,null,0]
[null,null,null,null," ",null,null,0]
[null,null,null,null," ",null,null,0]
[null,null,null,null," ",null,null,0]
[null,null,null,null," ",null,null,0]
[null,null,null,null," ",null,null,0]
[null,null,null,null,{"$f":"IF(D1481>0,VLOOKUP(D1481,entidades,2,FALSE),\" \")","v":" "},null,null,{"$f":"+F1481+G1481","v":0}]
[null,null,null,null," ",null,null,0]
[null,null,null,null," ",null,null,0]
[null,null,null,null," ",null,null,0]
[null,null,null,null," ",null,null,0]
[null,null,null,null," ",null,null,0]
[null,null,null,null," ",null,null,0]
[null,null,null,null," ",null,null,0]
[null,null,null,null," ",null,null,0]
[null,null,null,null," ",null,null,0]
[null,null,null,null," ",null,null,0]
[null,null,null,null," ",null,null,0]
[null,null,null,null," ",null,null,0]
[null,null,null,null," ",null,null,0]
[null,null,null,null," ",null,null,0]
[null,null,null,null," ",null,null,0]
[null,null,null,null," ",null,null,0]
[null,null,null,null," ",null,null,0]
[null,null,null,null," ",null,null,0]
[null,null,null,null," ",null,null,0]
[null,null,null,null," ",null,null,0]
[null,null,null,null," ",null,null,0]
[null,null,null,null," ",null,null,0]
[null,null,null,null," ",null,null,0]
[null,null,null,null," ",null,null,0]
[null,null,null,null," ",null,null,0]
[null,null,null,null," ",null,null,0]
[null,null,null,null," ",null,null,0]
[null,null,null,null," ",null,null,0]
[null,null,null,null," ",null,null,0]
[null,null,null,null," ",null,null,0]
[null,null,null,null," ",null,null,0]
[null,null,null,null," ",null,null,0]
[null,null,null,null," ",null,null,0]
[null,null,null,null," ",null,null,0]
[null,null,null,null," ",null,null,0]
[null,null,null,null," ",null,null,0]
[null,null,null,null," ",null,null,0]
[null,null,null,null," ",null,null,0]
[null,null,null,null," ",null,null,0]
[null,null,null,null," ",null,null,0]
[null,null,null,null," ",null,null,0]
[null,null,null,null," ",null,null,0]
[null,null,null,null," ",null,null,0]
[null,null,null,null," ",null,null,0]
[null,null,null,null," ",null,null,0]
[null,null,null,null," ",null,null,0]
[null,null,null,null," ",null,null,0]
[null,null,null,null," ",null,null,0]
[null,null,null,null," ",null,null,0]
[null,null,null,null," ",null,null,0]
[null,null,null,null," ",null,null,0]
[null,null,null,null," ",null,null,0]
[null,null,null,null," ",null,null,0]
[null,null,null,null," ",null,null,0]
[null,null,null,null," ",null,null,0]
[null,null,null,null," ",null,null,0]
[null,null,null,null," ",null,null,0]
[null,null,null,null," ",null,null,0]
[null,null,null,null," ",null,null,0]
[null,null,null,null," ",null,null,0]
[null,null,null,null," ",null,null,0]
[null,null,null,null," ",null,null,0]
[null,null,null,null," ",null,null,0]
[null,null,null,null,{"$f":"IF(D1545>0,VLOOKUP(D1545,entidades,2,FALSE),\" \")","v":" "},null,null,{"$f":"+F1545+G1545","v":0}]
[null,null,null,null," ",null,null,0]
[null,null,null,null," ",null,null,0]
[null,null,null,null," ",null,null,0]
[null,null,null,null," ",null,null,0]
[null,null,null,null," ",null,null,0]
[null,null,null,null," ",null,null,0]
[null,null,null,null," ",null,null,0]
[null,null,null,null," ",null,null,0]
[null,null,null,null," ",null,null,0]
[null,null,null,null," ",null,null,0]
[null,null,null,null," ",null,null,0]
[null,null,null,null," ",null,null,0]
[null,null,null,null," ",null,null,0]
[null,null,null,null," ",null,null,0]
[null,null,null,null," ",null,null,0]
[null,null,null,null," ",null,null,0]
[null,null,null,null," ",null,null,0]
[null,null,null,null," ",null,null,0]
[null,null,null,null," ",null,null,0]
[null,null,null,null," ",null,null,0]
[null,null,null,null," ",null,null,0]
[null,null,null,null," ",null,null,0]
[null,null,null,null," ",null,null,0]
[null,null,null,null," ",null,null,0]
[null,null,null,null," ",null,null,0]
[null,null,null,null," ",null,null,0]
[null,null,null,null," ",null,null,0]
[null,null,null,null," ",null,null,0]
[null,null,null,null," ",null,null,0]
[null,null,null,null," ",null,null,0]
[null,null,null,null," ",null,null,0]
[null,null,null,null," ",null,null,0]
[null,null,null,null," ",null,null,0]
[null,null,null,null," ",null,null,0]
[null,null,null,null," ",null,null,0]
[null,null,null,null," ",null,null,0]
[null,null,null,null," ",null,null,0]
[null,null,null,null," ",null,null,0]
[null,null,null,null," ",null,null,0]
[null,null,null,null," ",null,null,0]
[null,null,null,null," ",null,null,0]
[null,null,null,null," ",null,null,0]
[null,null,null,null," ",null,null,0]
[null,null,null,null," ",null,null,0]
[null,null,null,null," ",null,null,0]
[null,null,null,null," ",null,null,0]
[null,null,null,null," ",null,null,0]
[null,null,null,null," ",null,null,0]
[null,null,null,null," ",null,null,0]
[null,null,null,null," ",null,null,0]
[null,null,null,null," ",null,null,0]
[null,null,null,null," ",null,null,0]
[null,null,null,null," ",null,null,0]
[null,null,null,null," ",null,null,0]
[null,null,null,null," ",null,null,0]
[null,null,null,null," ",null,null,0]
[null,null,null,null," ",null,null,0]
[null,null,null,null," ",null,null,0]
[null,null,null,null," ",null,null,0]
[null,null,null,null," ",null,null,0]
[null,null,null,null," ",null,null,0]
[null,null,null,null," ",null,null,0]
[null,null,null,null," ",null,null,0]
[null,null,null,null,{"$f":"IF(D1609>0,VLOOKUP(D1609,entidades,2,FALSE),\" \")","v":" "},null,null,{"$f":"+F1609+G1609","v":0}]
[null,null,null,null," ",null,null,0]
[null,null,null,null," ",null,null,0]
[null,null,null,null," ",null,null,0]
[null,null,null,null," ",null,null,0]
[null,null,null,null," ",null,null,0]
[null,null,null,null," ",null,null,0]
[null,null,null,null," ",null,null,0]
[null,null,null,null," ",null,null,0]
[null,null,null,null," ",null,null,0]
[null,null,null,null," ",null,null,0]
[null,null,null,null," ",null,null,0]
[null,null,null,null," ",null,null,0]
[null,null,null,null," ",null,null,0]
[null,null,null,null," ",null,null,0]
[null,null,null,null," ",null,null,0]
[null,null,null,null," ",null,null,0]
[null,null,null,null," ",null,null,0]
[null,null,null,null," ",null,null,0]
[null,null,null,null," ",null,null,0]
[null,null,null,null," ",null,null,0]
[null,null,null,null," ",null,null,0]
[null,null,null,null," ",null,null,0]
[null,null,null,null," ",null,null,0]
[null,null,null,null," ",null,null,0]
[null,null,null,null," ",null,null,0]
[null,null,null,null," ",null,null,0]
[null,null,null,null," ",null,null,0]
[null,null,null,null," ",null,null,0]
[null,null,null,null," ",null,null,0]
[null,null,null,null," ",null,null,0]
[null,null,null,null," ",null,null,0]
[null,null,null,null," ",null,null,0]
[null,null,null,null," ",null,null,0]
[null,null,null,null," ",null,null,0]
[null,null,null,null," ",null,null,0]
[null,null,null,null," ",null,null,0]
[null,null,null,null," ",null,null,0]
[null,null,null,null," ",null,null,0]
[null,null,null,null," ",null,null,0]
[null,null,null,null," ",null,null,0]
[null,null,null,null," ",null,null,0]
[null,null,null,null," ",null,null,0]
[null,null,null,null," ",null,null,0]
[null,null,null,null," ",null,null,0]
[null,null,null,null," ",null,null,0]
[null,null,null,null," ",null,null,0]
[null,null,null,null," ",null,null,0]
[null,null,null,null," ",null,null,0]
[null,null,null,null," ",null,null,0]
[null,null,null,null," ",null,null,0]
[null,null,null,null," ",null,null,0]
[null,null,null,null," ",null,null,0]
[null,null,null,null," ",null,null,0]
[null,null,null,null," ",null,null,0]
[null,null,null,null," ",null,null,0]
[null,null,null,null," ",null,null,0]
[null,null,null,null," ",null,null,0]
[null,null,null,null," ",null,null,0]
[null,null,null,null," ",null,null,0]
[null,null,null,null," ",null,null,0]
[null,null,null,null," ",null,null,0]
[null,null,null,null," ",null,null,0]
[null,null,null,null," ",null,null,0]
[null,null,null,null,{"$f":"IF(D1673>0,VLOOKUP(D1673,entidades,2,FALSE),\" \")","v":" "},null,null,{"$f":"+F1673+G1673","v":0}]
[null,null,null,null," ",null,null,0]
[null,null,null,null," ",null,null,0]
[null,null,null,null," ",null,null,0]
[null,null,null,null," ",null,null,0]
[null,null,null,null," ",null,null,0]
[null,null,null,null," ",null,null,0]
[null,null,null,null," ",null,null,0]
[null,null,null,null," ",null,null,0]
[null,null,null,null," ",null,null,0]
[null,null,null,null," ",null,null,0]
[null,null,null,null," ",null,null,0]
[null,null,null,null," ",null,null,0]
[null,null,null,null," ",null,null,0]
[null,null,null,null," ",null,null,0]
[null,null,null,null," ",null,null,0]
[null,null,null,null," ",null,null,0]
[null,null,null,null," ",null,null,0]
[null,null,null,null," ",null,null,0]
[null,null,null,null," ",null,null,0]
[null,null,null,null," ",null,null,0]
[null,null,null,null," ",null,null,0]
[null,null,null,null," ",null,null,0]
[null,null,null,null," ",null,null,0]
[null,null,null,null," ",null,null,0]
[null,null,null,null," ",null,null,0]
[null,null,null,null," ",null,null,0]
[null,null,null,null," ",null,null,0]
[null,null,null,null," ",null,null,0]
[null,null,null,null," ",null,null,0]
[null,null,null,null," ",null,null,0]
[null,null,null,null," ",null,null,0]
[null,null,null,null," ",null,null,0]
[null,null,null,null," ",null,null,0]
[null,null,null,null," ",null,null,0]
[null,null,null,null," ",null,null,0]
[null,null,null,null," ",null,null,0]
[null,null,null,null," ",null,null,0]
[null,null,null,null," ",null,null,0]
[null,null,null,null," ",null,null,0]
[null,null,null,null," ",null,null,0]
[null,null,null,null," ",null,null,0]
[null,null,null,null," ",null,null,0]
[null,null,null,null," ",null,null,0]
[null,null,null,null," ",null,null,0]
[null,null,null,null," ",null,null,0]
[null,null,null,null," ",null,null,0]
[null,null,null,null," ",null,null,0]
[null,null,null,null," ",null,null,0]
[null,null,null,null," ",null,null,0]
[null,null,null,null," ",null,null,0]
[null,null,null,null," ",null,null,0]
[null,null,null,null," ",null,null,0]
[null,null,null,null," ",null,null,0]
[null,null,null,null," ",null,null,0]
[null,null,null,null," ",null,null,0]
[null,null,null,null," ",null,null,0]
[null,null,null,null," ",null,null,0]
[null,null,null,null," ",null,null,0]
[null,null,null,null," ",null,null,0]
[null,null,null,null," ",null,null,0]
[null,null,null,null," ",null,null,0]
[null,null,null,null," ",null,null,0]
[null,null,null,null," ",null,null,0]
[null,null,null,null,{"$f":"IF(D1737>0,VLOOKUP(D1737,entidades,2,FALSE),\" \")","v":" "},null,null,{"$f":"+F1737+G1737","v":0}]
[null,null,null,null," ",null,null,0]
[null,null,null,null," ",null,null,0]
[null,null,null,null," ",null,null,0]
[null,null,null,null," ",null,null,0]
[null,null,null,null," ",null,null,0]
[null,null,null,null," ",null,null,0]
[null,null,null,null," ",null,null,0]
[null,null,null,null," ",null,null,0]
[null,null,null,null," ",null,null,0]
[null,null,null,null," ",null,null,0]
[null,null,null,null," ",null,null,0]
[null,null,null,null," ",null,null,0]
[null,null,null,null," ",null,null,0]
[null,null,null,null," ",null,null,0]
[null,null,null,null," ",null,null,0]
[null,null,null,null," ",null,null,0]
[null,null,null,null," ",null,null,0]
[null,null,null,null," ",null,null,0]
[null,null,null,null," ",null,null,0]
[null,null,null,null," ",null,null,0]
[null,null,null,null," ",null,null,0]
[null,null,null,null," ",null,null,0]
[null,null,null,null," ",null,null,0]
[null,null,null,null," ",null,null,0]
[null,null,null,null," ",null,null,0]
[null,null,null,null," ",null,null,0]
[null,null,null,null," ",null,null,0]
[null,null,null,null," ",null,null,0]
[null,null,null,null," ",null,null,0]
[null,null,null,null," ",null,null,0]
[null,null,null,null," ",null,null,0]
[null,null,null,null," ",null,null,0]
[null,null,null,null," ",null,null,0]
[null,null,null,null," ",null,null,0]
[null,null,null,null," ",null,null,0]
[null,null,null,null," ",null,null,0]
[null,null,null,null," ",null,null,0]
[null,null,null,null," ",null,null,0]
[null,null,null,null," ",null,null,0]
[null,null,null,null," ",null,null,0]
[null,null,null,null," ",null,null,0]
[null,null,null,null," ",null,null,0]
[null,null,null,null," ",null,null,0]
[null,null,null,null," ",null,null,0]
[null,null,null,null," ",null,null,0]
[null,null,null,null," ",null,null,0]
[null,null,null,null," ",null,null,0]
[null,null,null,null," ",null,null,0]
[null,null,null,null," ",null,null,0]
[null,null,null,null," ",null,null,0]
[null,null,null,null," ",null,null,0]
[null,null,null,null," ",null,null,0]
[null,null,null,null," ",null,null,0]
[null,null,null,null," ",null,null,0]
[null,null,null,null," ",null,null,0]
[null,null,null,null," ",null,null,0]
[null,null,null,null," ",null,null,0]
[null,null,null,null," ",null,null,0]
[null,null,null,null," ",null,null,0]
[null,null,null,null," ",null,null,0]
[null,null,null,null," ",null,null,0]
[null,null,null,null," ",null,null,0]
[null,null,null,null," ",null,null,0]
[null,null,null,null,{"$f":"IF(D1801>0,VLOOKUP(D1801,entidades,2,FALSE),\" \")","v":" "},null,null,{"$f":"+F1801+G1801","v":0}]
[null,null,null,null," ",null,null,0]
[null,null,null,null," ",null,null,0]
[null,null,null,null," ",null,null,0]
[null,null,null,null," ",null,null,0]
[null,null,null,null," ",null,null,0]
[null,null,null,null," ",null,null,0]
[null,null,null,null," ",null,null,0]
[null,null,null,null," ",null,null,0]
[null,null,null,null," ",null,null,0]
[null,null,null,null," ",null,null,0]
[null,null,null,null," ",null,null,0]
[null,null,null,null," ",null,null,0]
[null,null,null,null," ",null,null,0]
[null,null,null,null," ",null,null,0]
[null,null,null,null," ",null,null,0]
[null,null,null,null," ",null,null,0]
[null,null,null,null," ",null,null,0]
[null,null,null,null," ",null,null,0]
[null,null,null,null," ",null,null,0]
[null,null,null,null," ",null,null,0]
[null,null,null,null," ",null,null,0]
[null,null,null,null," ",null,null,0]
[null,null,null,null," ",null,null,0]
[null,null,null,null," ",null,null,0]
[null,null,null,null," ",null,null,0]
[null,null,null,null," ",null,null,0]
[null,null,null,null," ",null,null,0]
[null,null,null,null," ",null,null,0]
[null,null,null,null," ",null,null,0]
[null,null,null,null," ",null,null,0]
[null,null,null,null," ",null,null,0]
[null,null,null,null," ",null,null,0]
[null,null,null,null," ",null,null,0]
[null,null,null,null," ",null,null,0]
[null,null,null,null," ",null,null,0]
[null,null,null,null," ",null,null,0]
[null,null,null,null," ",null,null,0]
[null,null,null,null," ",null,null,0]
[null,null,null,null," ",null,null,0]
[null,null,null,null," ",null,null,0]
[null,null,null,null," ",null,null,0]
[null,null,null,null," ",null,null,0]
[null,null,null,null," ",null,null,0]
[null,null,null,null," ",null,null,0]
[null,null,null,null," ",null,null,0]
[null,null,null,null," ",null,null,0]
[null,null,null,null," ",null,null,0]
[null,null,null,null," ",null,null,0]
[null,null,null,null," ",null,null,0]
[null,null,null,null," ",null,null,0]
[null,null,null,null," ",null,null,0]
[null,null,null,null," ",null,null,0]
[null,null,null,null," ",null,null,0]
[null,null,null,null," ",null,null,0]
[null,null,null,null," ",null,null,0]
[null,null,null,null," ",null,null,0]
[null,null,null,null," ",null,null,0]
[null,null,null,null," ",null,null,0]
[null,null,null,null," ",null,null,0]
[null,null,null,null," ",null,null,0]
[null,null,null,null," ",null,null,0]
[null,null,null,null," ",null,null,0]
[null,null,null,null," ",null,null,0]
[null,null,null,null,{"$f":"IF(D1865>0,VLOOKUP(D1865,entidades,2,FALSE),\" \")","v":" "},null,null,{"$f":"+F1865+G1865","v":0}]
[null,null,null,null," ",null,null,0]
[null,null,null,null," ",null,null,0]
[null,null,null,null," ",null,null,0]
[null,null,null,null," ",null,null,0]
[null,null,null,null," ",null,null,0]
[null,null,null,null," ",null,null,0]
[null,null,null,null," ",null,null,0]
[null,null,null,null," ",null,null,0]
[null,null,null,null," ",null,null,0]
[null,null,null,null," ",null,null,0]
[null,null,null,null," ",null,null,0]
[null,null,null,null," ",null,null,0]
[null,null,null,null," ",null,null,0]
[null,null,null,null," ",null,null,0]
[null,null,null,null," ",null,null,0]
[null,null,null,null," ",null,null,0]
[null,null,null,null," ",null,null,0]
[null,null,null,null," ",null,null,0]
[null,null,null,null," ",null,null,0]
[null,null,null,null," ",null,null,0]
[null,null,null,null," ",null,null,0]
[null,null,null,null," ",null,null,0]
[null,null,null,null," ",null,null,0]
[null,null,null,null," ",null,null,0]
[null,null,null,null," ",null,null,0]
[null,null,null,null," ",null,null,0]
[null,null,null,null," ",null,null,0]
[null,null,null,null," ",null,null,0]
[null,null,null,null," ",null,null,0]
[null,null,null,null," ",null,null,0]
[null,null,null,null," ",null,null,0]
[null,null,null,null," ",null,null,0]
[null,null,null,null," ",null,null,0]
[null,null,null,null," ",null,null,0]
[null,null,null,null," ",null,null,0]
[null,null,null,null," ",null,null,0]
[null,null,null,null," ",null,null,0]
[null,null,null,null," ",null,null,0]
[null,null,null,null," ",null,null,0]
[null,null,null,null," ",null,null,0]
[null,null,null,null," ",null,null,0]
[null,null,null,null," ",null,null,0]
[null,null,null,null," ",null,null,0]
[null,null,null,null," ",null,null,0]
[null,null,null,null," ",null,null,0]
[null,null,null,null," ",null,null,0]
[null,null,null,null," ",null,null,0]
[null,null,null,null," ",null,null,0]
[null,null,null,null," ",null,null,0]
[null,null,null,null," ",null,null,0]
[null,null,null,null," ",null,null,0]
[null,null,null,null," ",null,null,0]
[null,null,null,null," ",null,null,0]
[null,null,null,null," ",null,null,0]
[null,null,null,null," ",null,null,0]
[null,null,null,null," ",null,null,0]
[null,null,null,null," ",null,null,0]
[null,null,null,null," ",null,null,0]
[null,null,null,null," ",null,null,0]
[null,null,null,null," ",null,null,0]
[null,null,null,null," ",null,null,0]
[null,null,null,null," ",null,null,0]
[null,null,null,null," ",null,null,0]
[null,null,null,null,{"$f":"IF(D1929>0,VLOOKUP(D1929,entidades,2,FALSE),\" \")","v":" "},null,null,{"$f":"+F1929+G1929","v":0}]
[null,null,null,null," ",null,null,0]
[null,null,null,null," ",null,null,0]
[null,null,null,null," ",null,null,0]
[null,null,null,null," ",null,null,0]
[null,null,null,null," ",null,null,0]
[null,null,null,null," ",null,null,0]
[null,null,null,null," ",null,null,0]
[null,null,null,null," ",null,null,0]
[null,null,null,null," ",null,null,0]
[null,null,null,null," ",null,null,0]
[null,null,null,null," ",null,null,0]
[null,null,null,null," ",null,null,0]
[null,null,null,null," ",null,null,0]
[null,null,null,null," ",null,null,0]
[null,null,null,null," ",null,null,0]
[null,null,null,null," ",null,null,0]
[null,null,null,null," ",null,null,0]
[null,null,null,null," ",null,null,0]
[null,null,null,null," ",null,null,0]
[null,null,null,null," ",null,null,0]
[null,null,null,null," ",null,null,0]
[null,null,null,null," ",null,null,0]
[null,null,null,null," ",null,null,0]
[null,null,null,null," ",null,null,0]
[null,null,null,null," ",null,null,0]
[null,null,null,null," ",null,null,0]
[null,null,null,null," ",null,null,0]
[null,null,null,null," ",null,null,0]
[null,null,null,null," ",null,null,0]
[null,null,null,null," ",null,null,0]
[null,null,null,null," ",null,null,0]
[null,null,null,null," ",null,null,0]
[null,null,null,null," ",null,null,0]
[null,null,null,null," ",null,null,0]
[null,null,null,null," ",null,null,0]
[null,null,null,null," ",null,null,0]
[null,null,null,null," ",null,null,0]
[null,null,null,null," ",null,null,0]
[null,null,null,null," ",null,null,0]
[null,null,null,null," ",null,null,0]
[null,null,null,null," ",null,null,0]
[null,null,null,null," ",null,null,0]
[null,null,null,null," ",null,null,0]
[null,null,null,null," ",null,null,0]
[null,null,null,null," ",null,null,0]
[null,null,null,null," ",null,null,0]
[null,null,null,null," ",null,null,0]
[null,null,null,null," ",null,null,0]
[null,null,null,null," ",null,null,0]
[null,null,null,null," ",null,null,0]
[null,null,null,null," ",null,null,0]
[null,null,null,null," ",null,null,0]
[null,null,null,null," ",null,null,0]
[null,null,null,null," ",null,null,0]
[null,null,null,null," ",null,null,0]
[null,null,null,null," ",null,null,0]
[null,null,null,null," ",null,null,0]
[null,null,null,null," ",null,null,0]
[null,null,null,null," ",null,null,0]
[null,null,null,null," ",null,null,0]
[null,null,null,null," ",null,null,0]
[null,null,null,null," ",null,null,0]
[null,null,null,null," ",null,null,0]
[null,null,null,null,{"$f":"IF(D1993>0,VLOOKUP(D1993,entidades,2,FALSE),\" \")","v":" "},null,null,{"$f":"+F1993+G1993","v":0}]
[null,null,null,null," ",null,null,0]
[null,null,null,null," ",null,null,0]
[null,null,null,null," ",null,null,0]
[null,null,null,null," ",null,null,0]
[null,null,null,null," ",null,null,0]
[null,null,null,null," ",null,null,0]
[null,null,null,null," ",null,null,0]
[null,null,null,null," ",null,null,0]
[null,null,null,null," ",null,null,0]
[null,null,null,null," ",null,null,0]
[null,null,null,null," ",null,null,0]
[null,null,null,null," ",null,null,0]
[null,null,null,null," ",null,null,0]
[null,null,null,null," ",null,null,0]
[null,null,null,null," ",null,null,0]
[null,null,null,null," ",null,null,0]
[null,null,null,null," ",null,null,0]
[null,null,null,null," ",null,null,0]
[null,null,null,null," ",null,null,0]
[null,null,null,null," ",null,null,0]
[null,null,null,null," ",null,null,0]
[null,null,null,null," ",null,null,0]
[null,null,null,null," ",null,null,0]
[null,null,null,null," ",null,null,0]
[null,null,null,null," ",null,null,0]
[null,null,null,null," ",null,null,0]
[null,null,null,null," ",null,null,0]
[null,null,null,null," ",null,null,0]
[null,null,null,null," ",null,null,0]
[null,null,null,null," ",null,null,0]
[null,null,null,null," ",null,null,0]
[null,null,null,null," ",null,null,0]
[null,null,null,null," ",null,null,0]
[null,null,null,null," ",null,null,0]
[null,null,null,null," ",null,null,0]
[null,null,null,null," ",null,null,0]
[null,null,null,null," ",null,null,0]
[null,null,null,null," ",null,null,0]
[null,null,null,null," ",null,null,0]
[null,null,null,null," ",null,null,0]
[null,null,null,null," ",null,null,0]
[null,null,null,null," ",null,null,0]
[null,null,null,null," ",null,null,0]
[null,null,null,null," ",null,null,0]
[null,null,null,null," ",null,null,0]
[null,null,null,null," ",null,null,0]
[null,null,null,null," ",null,null,0]
[null,null,null,null," ",null,null,0]
[null,null,null,null," ",null,null,0]
[null,null,null,null," ",null,null,0]
[null,null,null,null," ",null,null,0]
[null,null,null,null," ",null,null,0]
[null,null,null,null," ",null,null,0]
[null,null,null,null," ",null,null,0]
[null,null,null,null," ",null,null,0]
[null,null,null,null," ",null,null,0]
[null,null,null,null," ",null,null,0]
[null,null,null,null," ",null,null,0]
[null,null,null,null," ",null,null,0]
[null,null,null,null," ",null,null,0]
[null,null,null,null," ",null,null,0]
[null,null,null,null," ",null,null,0]
[null,null,null,null," ",null,null,0]
[null,null,null,null,{"$f":"IF(D2057>0,VLOOKUP(D2057,entidades,2,FALSE),\" \")","v":" "},null,null,{"$f":"+F2057+G2057","v":0}]
[null,null,null,null," ",null,null,0]
[null,null,null,null," ",null,null,0]
[null,null,null,null," ",null,null,0]
[null,null,null,null," ",null,null,0]
[null,null,null,null," ",null,null,0]
[null,null,null,null," ",null,null,0]
[null,null,null,null," ",null,null,0]
[null,null,null,null," ",null,null,0]
[null,null,null,null," ",null,null,0]
[null,null,null,null," ",null,null,0]
[null,null,null,null," ",null,null,0]
[null,null,null,null," ",null,null,0]
[null,null,null,null," ",null,null,0]
[null,null,null,null," ",null,null,0]
[null,null,null,null," ",null,null,0]
[null,null,null,null," ",null,null,0]
[null,null,null,null," ",null,null,0]
[null,null,null,null," ",null,null,0]
[null,null,null,null," ",null,null,0]
[null,null,null,null," ",null,null,0]
[null,null,null,null," ",null,null,0]
[null,null,null,null," ",null,null,0]
[null,null,null,null," ",null,null,0]
[null,null,null,null," ",null,null,0]
[null,null,null,null," ",null,null,0]
[null,null,null,null," ",null,null,0]
[null,null,null,null," ",null,null,0]
[null,null,null,null," ",null,null,0]
[null,null,null,null," ",null,null,0]
[null,null,null,null," ",null,null,0]
[null,null,null,null," ",null,null,0]
[null,null,null,null," ",null,null,0]
[null,null,null,null," ",null,null,0]
[null,null,null,null," ",null,null,0]
[null,null,null,null," ",null,null,0]
[null,null,null,null," ",null,null,0]
[null,null,null,null," ",null,null,0]
[null,null,null,null," ",null,null,0]
[null,null,null,null," ",null,null,0]
[null,null,null,null," ",null,null,0]
[null,null,null,null," ",null,null,0]
[null,null,null,null," ",null,null,0]
[null,null,null,null," ",null,null,0]
[null,null,null,null," ",null,null,0]
[null,null,null,null," ",null,null,0]
[null,null,null,null," ",null,null,0]
[null,null,null,null," ",null,null,0]
[null,null,null,null," ",null,null,0]
[null,null,null,null," ",null,null,0]
[null,null,null,null," ",null,null,0]
[null,null,null,null," ",null,null,0]
[null,null,null,null," ",null,null,0]
[null,null,null,null," ",null,null,0]
[null,null,null,null," ",null,null,0]
[null,null,null,null," ",null,null,0]
[null,null,null,null," ",null,null,0]
[null,null,null,null," ",null,null,0]
[null,null,null,null," ",null,null,0]
[null,null,null,null," ",null,null,0]
[null,null,null,null," ",null,null,0]
[null,null,null,null," ",null,null,0]
[null,null,null,null," ",null,null,0]
[null,null,null,null," ",null,null,0]
[null,null,null,null,{"$f":"IF(D2121>0,VLOOKUP(D2121,entidades,2,FALSE),\" \")","v":" "},null,null,{"$f":"+F2121+G2121","v":0}]
[null,null,null,null," ",null,null,0]
[null,null,null,null," ",null,null,0]
[null,null,null,null," ",null,null,0]
[null,null,null,null," ",null,null,0]
[null,null,null,null," ",null,null,0]
[null,null,null,null," ",null,null,0]
[null,null,null,null," ",null,null,0]
[null,null,null,null," ",null,null,0]
[null,null,null,null," ",null,null,0]
[null,null,null,null," ",null,null,0]
[null,null,null,null," ",null,null,0]
[null,null,null,null," ",null,null,0]
[null,null,null,null," ",null,null,0]
[null,null,null,null," ",null,null,0]
[null,null,null,null," ",null,null,0]
[null,null,null,null," ",null,null,0]
[null,null,null,null," ",null,null,0]
[null,null,null,null," ",null,null,0]
[null,null,null,null," ",null,null,0]
[null,null,null,null," ",null,null,0]
[null,null,null,null," ",null,null,0]
[null,null,null,null," ",null,null,0]
[null,null,null,null," ",null,null,0]
[null,null,null,null," ",null,null,0]
[null,null,null,null," ",null,null,0]
[null,null,null,null," ",null,null,0]
[null,null,null,null," ",null,null,0]
[null,null,null,null," ",null,null,0]
[null,null,null,null," ",null,null,0]
[null,null,null,null," ",null,null,0]
[null,null,null,null," ",null,null,0]
[null,null,null,null," ",null,null,0]
[null,null,null,null," ",null,null,0]
[null,null,null,null," ",null,null,0]
[null,null,null,null," ",null,null,0]
[null,null,null,null," ",null,null,0]
[null,null,null,null," ",null,null,0]
[null,null,null,null," ",null,null,0]
[null,null,null,null," ",null,null,0]
[null,null,null,null," ",null,null,0]
[null,null,null,null," ",null,null,0]
[null,null,null,null," ",null,null,0]
[null,null,null,null," ",null,null,0]
[null,null,null,null," ",null,null,0]
[null,null,null,null," ",null,null,0]
[null,null,null,null," ",null,null,0]
[null,null,null,null," ",null,null,0]
[null,null,null,null," ",null,null,0]
[null,null,null,null," ",null,null,0]
[null,null,null,null," ",null,null,0]
[null,null,null,null," ",null,null,0]
[null,null,null,null," ",null,null,0]
[null,null,null,null," ",null,null,0]
[null,null,null,null," ",null,null,0]
[null,null,null,null," ",null,null,0]
[null,null,null,null," ",null,null,0]
[null,null,null,null," ",null,null,0]
[null,null,null,null," ",null,null,0]
[null,null,null,null," ",null,null,0]
[null,null,null,null," ",null,null,0]
[null,null,null,null," ",null,null,0]
[null,null,null,null," ",null,null,0]
[null,null,null,null," ",null,null,0]
[null,null,null,null,{"$f":"IF(D2185>0,VLOOKUP(D2185,entidades,2,FALSE),\" \")","v":" "},null,null,{"$f":"+F2185+G2185","v":0}]
[null,null,null,null," ",null,null,0]
[null,null,null,null," ",null,null,0]
[null,null,null,null," ",null,null,0]
[null,null,null,null," ",null,null,0]
[null,null,null,null," ",null,null,0]
[null,null,null,null," ",null,null,0]
[null,null,null,null," ",null,null,0]
[null,null,null,null," ",null,null,0]
[null,null,null,null," ",null,null,0]

{"sheet":"Áreas Desarrollo","index":10,"n_rows":25,"n_cols":15,"rows_kept":25,"cut":false,"hidden":true,"merged":[[1,1,1,10]]}
[null,"Presupuesto por Área de Desarrollo y/o Servicios Tecnológicos",null,null,null,null,null,null,null,null,null,null,"Proyecto:",{"$f":"+Inicio!$B$9","v":"Escriba el nombre del proyecto postulado…"}]
[null,"Confeccione un presupuesto estimativo por Área de Desarrollo y/o Servicios Tecnológicos del proyecto.\nEl presupuesto relacionado con la gestión transversal del proyecto deberá ser ingresado en la columna “Gestión del Proyecto”.\nDe ser necesario deberá prorratear el presupuesto entre más de una Área de Desarrollo y/o Servicios Tecnológicos",null,null,null,null,null,null,null,null,null,null,"Beneficiario:",{"$f":"VLOOKUP(\"Beneficiario Mandatario\",Participantes!$B$2:$F$86,5,FALSE)","v":{"$error":"#N/A"}}]
[]
[null,"Valores en Millones de pesos (MM$)"]
[null,"Entidad Participante","Gestión del Proyecto","Área (1)","Área (2)","Área (3)","Área (4)","Área (5)","Área (6)","Área (7)","Área (8)","Área (9)","Área (10)","Total"]
[null,"Corfo",null,null,null,null,null,null,null,null,null,null,null,{"$f":"+SUM(C6:M6)","v":0},{"$f":"IF(N6='Tablas Resumen'!E8,\"OK\",\"Monto total no cuadra con el total del proyecto por cuentas\")","v":"OK"}]
[null,"Beneficiario",null,null,null,null,null,null,null,null,null,null,null,{"$f":"+SUM(C7:M7)","v":0},{"$f":"IF(N7='Tablas Resumen'!E9,\"OK\",\"Monto total no cuadra con el total del proyecto por cuentas\")","v":"OK"}]
[null,"Beneficiario Mandatario",null,null,null,null,null,null,null,null,null,null,null,0,{"$f":"IF(N8='Tablas Resumen'!E10,\"OK\",\"Monto total no cuadra con el total del proyecto por cuentas\")","v":"OK"}]
[null,"Beneficiario Mandante",null,null,null,null,null,null,null,null,null,null,null,0,{"$f":"IF(N9='Tablas Resumen'!E11,\"OK\",\"Monto total no cuadra con el total del proyecto por cuentas\")","v":"OK"}]
[null,"Coejecutor",null,null,null,null,null,null,null,null,null,null,null,0,{"$f":"IF(N10='Tablas Resumen'!E12,\"OK\",\"Monto total no cuadra con el total del proyecto por cuentas\")","v":"OK"}]
[null,"Asociado",null,null,null,null,null,null,null,null,null,null,null,0,{"$f":"IF(N11='Tablas Resumen'!E13,\"OK\",\"Monto total no cuadra con el total del proyecto por cuentas\")","v":"OK"}]
[null,"Total",{"$f":"SUM(C6:C11)","v":0},{"$f":"SUM(D6:D11)","v":0},0,0,0,0,0,0,0,0,0,0,{"$f":"IF(N12='Tablas Resumen'!E14,\"OK\",\"Monto total no cuadra con el total del proyecto por cuentas\")","v":"OK"}]
[]
[]
[null,"Área de Desarrollo y/o Servicios Tecnológicos:"]
[null,"1. <escriba el nombre del área de I+D>"]
[null,"2. etc…"]
[null,"3. "]
[null,"4. "]
[null,"5. "]
[null,"6. "]
[null,"7. "]
[null,"8. "]
[null,"9. "]
[null,"10. "]

{"sheet":"Tablas Resumen","index":11,"n_rows":72,"n_cols":62,"rows_kept":72,"cut":false,"hidden":false,"merged":[]}
[null,"Resumen Presupuesto",null,null,null,null,"Proyecto:",{"$f":"+Inicio!$B$9","v":"Escriba el nombre del proyecto postulado…"}]
[null,"Revise todas las tablas y haga los ajustes necesarios.",null,null,null,null,"Beneficiario:",{"$f":"VLOOKUP(\"Beneficiario Mandatario\",Participantes!$B$2:$F$86,5,FALSE)","v":{"$error":"#N/A"}}]
[]
[]
[null,"Presupuesto General"]
[null,"Valores en Millones de pesos (MM$)",null,null,null,null,null,null,null,null,null,null,null,null,null,null,null,null,null,null,null,null,"pecuniario",null,null,null,null,"valorizado"]
[null,"Entidad Participante","Pecuniario","Valorizado","Total",null,null,null,null,null,null,null,null,null,null,null,null,null,null,null,null,null,"a1","a2","a3","e2","e3","a1","a2","a3","e2","e3"]
[null,"Corfo",{"$f":"+SUM(W8:AA8)","v":0},{"$f":"SUM(AB8:AF8)","v":0},{"$f":"+C8+D8","v":0},{"$f":"+IF(E8>N30,\"Supera máximo aporte Corfo para el proyecto\",\"Sin alertas\")","v":"Sin alertas"},null,null,null,null,null,null,null,null,null,null,null,null,null,null,null,null,{"$f":"SUMIF('Año 1 E1'!$E$9:$E$4893,$B8,'Año 1 E1'!$F$9:$F$4893)","v":0},{"$f":"SUMIF('Etapa 1'!$C$6:$C$90,$B8,'Etapa 1'!$P$6:$P$90)","v":0},{"$f":"SUMIF('Año 3 E1'!$C$6:$C$90,$B8,'Año 3 E1'!$P$6:$P$90)","v":0},{"$f":"SUMIF('Etapa 2'!$C$6:$C$90,$B8,'Etapa 2'!$P$6:$P$90)","v":0},{"$f":"SUMIF('Etapa 3'!$C$6:$C$90,$B8,'Etapa 3'!$P$6:$P$90)","v":0},{"$f":"SUMIF('Año 1 E1'!$E$9:$E$4893,$B8,'Año 1 E1'!$G$9:$G$4893)","v":0},{"$f":"SUMIF('Etapa 1'!$C$6:$C$90,$B8,'Etapa 1'!$Q$6:$Q$90)","v":0},{"$f":"SUMIF('Año 3 E1'!$C$6:$C$90,$B8,'Año 3 E1'!$Q$6:$Q$90)","v":0},{"$f":"SUMIF('Etapa 2'!$C$6:$C$90,$B8,'Etapa 2'!$Q$6:$Q$90)","v":0},{"$f":"SUMIF('Etapa 3'!$C$6:$C$90,$B8,'Etapa 3'!$Q$6:$Q$90)","v":0}]
[null,"Beneficiario",{"$f":"+SUM(W9:AA9)","v":0},{"$f":"SUM(AB9:AF9)","v":0},{"$f":"+C9+D9","v":0},"En caso de postulacion Individual",null,null,null,null,null,null,null,null,null,null,null,null,null,null,null,null,{"$f":"SUMIF('Año 1 E1'!$E$9:$E$4893,$B9,'Año 1 E1'!$F$9:$F$4893)","v":0},{"$f":"SUMIF('Etapa 1'!$C$6:$C$90,$B9,'Etapa 1'!$P$6:$P$90)","v":0},{"$f":"SUMIF('Año 3 E1'!$C$6:$C$90,$B9,'Año 3 E1'!$P$6:$P$90)","v":0},{"$f":"SUMIF('Etapa 2'!$C$6:$C$90,$B9,'Etapa 2'!$P$6:$P$90)","v":0},{"$f":"SUMIF('Etapa 3'!$C$6:$C$90,$B9,'Etapa 3'!$P$6:$P$90)","v":0},{"$f":"SUMIF('Año 1 E1'!$E$9:$E$4893,$B9,'Año 1 E1'!$G$9:$G$4893)","v":0},{"$f":"SUMIF('Etapa 1'!$C$6:$C$90,$B9,'Etapa 1'!$Q$6:$Q$90)","v":0},{"$f":"SUMIF('Año 3 E1'!$C$6:$C$90,$B9,'Año 3 E1'!$Q$6:$Q$90)","v":0},{"$f":"SUMIF('Etapa 2'!$C$6:$C$90,$B9,'Etapa 2'!$Q$6:$Q$90)","v":0},{"$f":"SUMIF('Etapa 3'!$C$6:$C$90,$B9,'Etapa 3'!$Q$6:$Q$90)","v":0}]
[null,"Beneficiario Mandatario",0,0,0,"En caso de postulación Conjunta",null,null,null,null,null,null,null,null,null,null,null,null,null,null,null,null,{"$f":"SUMIF('Año 1 E1'!$E$9:$E$4893,$B10,'Año 1 E1'!$F$9:$F$4893)","v":0},{"$f":"SUMIF('Etapa 1'!$C$6:$C$90,$B10,'Etapa 1'!$P$6:$P$90)","v":0},{"$f":"SUMIF('Año 3 E1'!$C$6:$C$90,$B10,'Año 3 E1'!$P$6:$P$90)","v":0},{"$f":"SUMIF('Etapa 2'!$C$6:$C$90,$B10,'Etapa 2'!$P$6:$P$90)","v":0},{"$f":"SUMIF('Etapa 3'!$C$6:$C$90,$B10,'Etapa 3'!$P$6:$P$90)","v":0},{"$f":"SUMIF('Año 1 E1'!$E$9:$E$4893,$B10,'Año 1 E1'!$G$9:$G$4893)","v":0},{"$f":"SUMIF('Etapa 1'!$C$6:$C$90,$B10,'Etapa 1'!$Q$6:$Q$90)","v":0},{"$f":"SUMIF('Año 3 E1'!$C$6:$C$90,$B10,'Año 3 E1'!$Q$6:$Q$90)","v":0},{"$f":"SUMIF('Etapa 2'!$C$6:$C$90,$B10,'Etapa 2'!$Q$6:$Q$90)","v":0},{"$f":"SUMIF('Etapa 3'!$C$6:$C$90,$B10,'Etapa 3'!$Q$6:$Q$90)","v":0}]
[null,"Beneficiario Mandante",0,0,0,"En caso de postulación Conjunta",null,null,null,null,null,null,null,null,null,null,null,null,null,null,null,null,{"$f":"SUMIF('Año 1 E1'!$E$9:$E$4893,$B11,'Año 1 E1'!$F$9:$F$4893)","v":0},{"$f":"SUMIF('Etapa 1'!$C$6:$C$90,$B11,'Etapa 1'!$P$6:$P$90)","v":0},{"$f":"SUMIF('Año 3 E1'!$C$6:$C$90,$B11,'Año 3 E1'!$P$6:$P$90)","v":0},{"$f":"SUMIF('Etapa 2'!$C$6:$C$90,$B11,'Etapa 2'!$P$6:$P$90)","v":0},{"$f":"SUMIF('Etapa 3'!$C$6:$C$90,$B11,'Etapa 3'!$P$6:$P$90)","v":0},{"$f":"SUMIF('Año 1 E1'!$E$9:$E$4893,$B11,'Año 1 E1'!$G$9:$G$4893)","v":0},{"$f":"SUMIF('Etapa 1'!$C$6:$C$90,$B11,'Etapa 1'!$Q$6:$Q$90)","v":0},{"$f":"SUMIF('Año 3 E1'!$C$6:$C$90,$B11,'Año 3 E1'!$Q$6:$Q$90)","v":0},{"$f":"SUMIF('Etapa 2'!$C$6:$C$90,$B11,'Etapa 2'!$Q$6:$Q$90)","v":0},{"$f":"SUMIF('Etapa 3'!$C$6:$C$90,$B11,'Etapa 3'!$Q$6:$Q$90)","v":0}]
[null,"Coejecutor",0,0,0,null,null,null,null,null,null,null,null,null,null,null,null,null,null,null,null,null,{"$f":"SUMIF('Año 1 E1'!$E$9:$E$4893,$B12,'Año 1 E1'!$F$9:$F$4893)","v":0},{"$f":"SUMIF('Etapa 1'!$C$6:$C$90,$B12,'Etapa 1'!$P$6:$P$90)","v":0},{"$f":"SUMIF('Año 3 E1'!$C$6:$C$90,$B12,'Año 3 E1'!$P$6:$P$90)","v":0},{"$f":"SUMIF('Etapa 2'!$C$6:$C$90,$B12,'Etapa 2'!$P$6:$P$90)","v":0},{"$f":"SUMIF('Etapa 3'!$C$6:$C$90,$B12,'Etapa 3'!$P$6:$P$90)","v":0},{"$f":"SUMIF('Año 1 E1'!$E$9:$E$4893,$B12,'Año 1 E1'!$G$9:$G$4893)","v":0},{"$f":"SUMIF('Etapa 1'!$C$6:$C$90,$B12,'Etapa 1'!$Q$6:$Q$90)","v":0},{"$f":"SUMIF('Año 3 E1'!$C$6:$C$90,$B12,'Año 3 E1'!$Q$6:$Q$90)","v":0},{"$f":"SUMIF('Etapa 2'!$C$6:$C$90,$B12,'Etapa 2'!$Q$6:$Q$90)","v":0},{"$f":"SUMIF('Etapa 3'!$C$6:$C$90,$B12,'Etapa 3'!$Q$6:$Q$90)","v":0}]
[null,"Asociado",0,0,0,{"$f":"IF(E13>0,IF(C13>0,\"Sin alertas\",\"Asociados al proyecto deberán aportar con recursos pecuniarios\"),\" \")","v":" "},null,null,null,null,null,null,null,null,null,null,null,null,null,null,null,null,{"$f":"SUMIF('Año 1 E1'!$E$9:$E$4893,$B13,'Año 1 E1'!$F$9:$F$4893)","v":0},{"$f":"SUMIF('Etapa 1'!$C$6:$C$90,$B13,'Etapa 1'!$P$6:$P$90)","v":0},{"$f":"SUMIF('Año 3 E1'!$C$6:$C$90,$B13,'Año 3 E1'!$P$6:$P$90)","v":0},{"$f":"SUMIF('Etapa 2'!$C$6:$C$90,$B13,'Etapa 2'!$P$6:$P$90)","v":0},{"$f":"SUMIF('Etapa 3'!$C$6:$C$90,$B13,'Etapa 3'!$P$6:$P$90)","v":0},{"$f":"SUMIF('Año 1 E1'!$E$9:$E$4893,$B13,'Año 1 E1'!$G$9:$G$4893)","v":0},{"$f":"SUMIF('Etapa 1'!$C$6:$C$90,$B13,'Etapa 1'!$Q$6:$Q$90)","v":0},{"$f":"SUMIF('Año 3 E1'!$C$6:$C$90,$B13,'Año 3 E1'!$Q$6:$Q$90)","v":0},{"$f":"SUMIF('Etapa 2'!$C$6:$C$90,$B13,'Etapa 2'!$Q$6:$Q$90)","v":0},{"$f":"SUMIF('Etapa 3'!$C$6:$C$90,$B13,'Etapa 3'!$Q$6:$Q$90)","v":0}]
[null,"Total",{"$f":"SUM(C8:C13)","v":0},0,{"$f":"SUM(E8:E13)","v":0}]
[]
[]
[]
[null,"Presupuesto por Etapas",null,"(por Entidades Participantes)"]
[null,"Valores en Millones de pesos (MM$)"]
[null,null,"Etapa 1",null,null,"Etapa 2",null,null,"Etapa 3",null,null,"Total"]
[null,"Entidad Participante","Pecuniario","Valorizado","Subtotal","Pecuniario","Valorizado","Subtotal","Pecuniario","Valorizado","Subtotal","Pecuniario","Valorizado","Subtotal"]
[null,"Corfo",{"$f":"+W8+X8+Y8","v":0},{"$f":"+AB8+AC8+AD8","v":0},{"$f":"+C22+D22","v":0},{"$f":"+Z8","v":0},{"$f":"+AE8","v":0},{"$f":"+F22+G22","v":0},{"$f":"+AA8","v":0},{"$f":"+AF8","v":0},{"$f":"+I22+J22","v":0},{"$f":"+C22+F22+I22","v":0},{"$f":"+D22+G22+J22","v":0},{"$f":"+L22+M22","v":0}]
[null,"Beneficiario",0,0,{"$f":"+C23+D23","v":0},{"$f":"+Z9","v":0},{"$f":"+AE9","v":0},{"$f":"+F23+G23","v":0},{"$f":"+AA9","v":0},{"$f":"+AF9","v":0},{"$f":"+I23+J23","v":0},{"$f":"+C23+F23+I23","v":0},{"$f":"+D23+G23+J23","v":0},{"$f":"+L23+M23","v":0}]
[null,"Beneficiario Mandatario",0,0,0,0,0,0,0,0,0,0,0,0]
[null,"Beneficiario Mandante",0,0,0,0,0,0,0,0,0,0,0,0]
[null,"Coejecutor",0,0,0,0,0,0,0,0,0,0,0,0]
[null,"Asociado",0,0,0,0,0,0,0,0,0,0,0,0]
[null,"Total",{"$f":"+SUM(C22:C27)","v":0},{"$f":"+SUM(D22:D27)","v":0},0,0,0,0,0,0,0,0,0,0]
[]
[null,"Máximo aporte Corfo por Etapas:",null,null,4000,null,null,1500,null,null,500,null,null,{"$f":"+E30+H30+K30","v":6000}]
[null,null,null,null,{"$f":"IF(E22>E30,\"Supera máximo\",\"OK\")","v":"OK"},null,null,{"$f":"IF(H22>H30,\"Supera máximo\",\"OK\")","v":"OK"},null,null,{"$f":"IF(K22>K30,\"Supera máximo\",\"OK\")","v":"OK"}]
[]
[null,"Máximo porcentaje aporte Corfo por Etapa:",null,null,0.8,null,null,0.65,null,null,0.35]
[null,"Aporte Corfo solicitado por Etapa:",null,null,{"$f":"+E22/E28","v":{"$error":"#DIV/0!"}},null,null,{"$f":"+H22/H28","v":{"$error":"#DIV/0!"}},null,null,{"$f":"+K22/K28","v":{"$error":"#DIV/0!"}}]
[null,null,null,null,{"$f":"IF(E34>E33,\"Supera máximo\", \"OK\")","v":{"$error":"#DIV/0!"}},null,null,{"$f":"IF(H34>H33,\"Supera máximo\", \"OK\")","v":{"$error":"#DIV/0!"}},null,null,{"$f":"IF(K34>K33,\"Supera máximo\", \"OK\")","v":{"$error":"#DIV/0!"}}]
[]
[]
[]
[]
[null,"Presupuesto por Etapas",null,"(por Cuentas)"]
[null,"Valores en Millones de pesos (MM$)"]
[null,null,"Etapa 1",null,null,"Etapa 2",null,null,"Etapa 3",null,null,"Total"]
[null,"Centas","Pecuniario","Valorizado","Subtotal","Pecuniario","Valorizado","Subtotal","Pecuniario","Valorizado","Subtotal","Pecuniario","Valorizado","Subtotal"]
[null,"RRHH",{"$f":"+W62+X62+Y62","v":0},{"$f":"+AB62+AC62+AD62","v":0},{"$f":"SUM(C44:D44)","v":0},{"$f":"+Z62","v":0},{"$f":"+AE62","v":0},{"$f":"SUM(F44:G44)","v":0},{"$f":"+AA62","v":0},{"$f":"+AF62","v":0},{"$f":"SUM(I44:J44)","v":0},{"$f":"+C44+F44+I44","v":0},{"$f":"+D44+G44+J44","v":0},{"$f":"SUM(L44:M44)","v":0}]
[null,"Operaciones",{"$f":"+AG62+AH62+AI62","v":0},{"$f":"+AL62+AM62+AN62","v":0},{"$f":"SUM(C45:D45)","v":0},{"$f":"+AJ62","v":0},{"$f":"+AO62","v":0},{"$f":"SUM(F45:G45)","v":0},{"$f":"+AK62","v":0},{"$f":"+AP62","v":0},{"$f":"SUM(I45:J45)","v":0},{"$f":"+C45+F45+I45","v":0},{"$f":"+D45+G45+J45","v":0},{"$f":"SUM(L45:M45)","v":0}]
[null,"Inversiones",{"$f":"+AQ62+AR62+AS62","v":0},{"$f":"+AV62+AW62+AX62","v":0},0,{"$f":"+AT62","v":0},{"$f":"+AY62","v":0},0,{"$f":"+AU62","v":0},{"$f":"+AZ62","v":0},0,0,0,0]
[null,"Administración",{"$f":"+BA62+BB62+BC62","v":0},{"$f":"+BF62+BG62+BH62","v":0},0,{"$f":"+BD62","v":0},{"$f":"+BI62","v":0},0,{"$f":"+BE62","v":0},{"$f":"+BJ62","v":0},0,0,0,0]
[null,"Total",{"$f":"SUM(C44:C47)","v":0},{"$f":"SUM(D44:D47)","v":0},0,0,0,0,0,0,0,0,0,0]
[]
[]
[]
[null,"Presupuesto por Cuentas",null,"(por Entidades Participantes)"]
[null,"Valores en Millones de pesos (MM$)"]
[null,null,"RRHH",null,null,"Operaciones",null,null,"Inversiones",null,null,"Administración",null,null,"Total",null,null,null,null,null,null,null,"RRHH pecuniario",null,null,null,null,"RRHH valorizado",null,null,null,null,"operaciones pecuniario",null,null,null,null,"operaciones valorizado",null,null,null,null,"inversiones pecuniario",null,null,null,null,"inversiones valorizado",null,null,null,null,"adm pecuniario",null,null,null,null,"adm valorizado"]
[null,"Entidad Participante","Pecuniario","Valorizado","Subtotal","Pecuniario","Valorizado","Subtotal","Pecuniario","Valorizado","Subtotal","Pecuniario","Valorizado","Subtotal","Pecuniario","Valorizado","Subtotal",null,null,null,null,null,"a1","a2","a3","e2","e3","a1","a2","a3","e2","e3","a1","a2","a3","e2","e3","a1","a2","a3","e2","e3","a1","a2","a3","e2","e3","a1","a2","a3","e2","e3","a1","a2","a3","e2","e3","a1","a2","a3","e2","e3"]
[null,"Corfo",{"$f":"+SUM(W56:AA56)","v":0},{"$f":"+SUM(AB56:AF56)","v":0},{"$f":"+C56+D56","v":0},{"$f":"+SUM(AG56:AK56)","v":0},{"$f":"SUM(AL56:AP56)","v":0},{"$f":"+F56+G56","v":0},{"$f":"+SUM(AQ56:AU56)","v":0},{"$f":"SUM(AV56:AZ56)","v":0},{"$f":"+I56+J56","v":0},{"$f":"+SUM(BA56:BE56)","v":0},{"$f":"SUM(BF56:BJ56)","v":0},{"$f":"+L56+M56","v":0},{"$f":"+C56+F56+I56+L56","v":0},{"$f":"+D56+G56+J56+M56","v":0},{"$f":"+O56+P56","v":0},null,null,null,null,null,{"$f":"SUMIFS('Año 1 E1'!$F$9:$F$4893,'Año 1 E1'!$B$9:$B$4893,\"RRHH\",'Año 1 E1'!$E$9:$E$4893,$B56)","v":0},{"$f":"SUMIF('Etapa 1'!$C$6:$C$90,$B56,'Etapa 1'!$D$6:$D$90)","v":0},{"$f":"SUMIF('Año 3 E1'!$C$6:$C$90,$B56,'Año 3 E1'!$D$6:$D$90)","v":0},{"$f":"SUMIF('Etapa 2'!$C$6:$C$90,$B56,'Etapa 2'!$D$6:$D$90)","v":0},{"$f":"SUMIF('Etapa 3'!$C$6:$C$90,$B56,'Etapa 3'!$D$6:$D$90)","v":0},{"$f":"SUMIFS('Año 1 E1'!$G$9:$G$4893,'Año 1 E1'!$B$9:$B$4893,\"RRHH\",'Año 1 E1'!$E$9:$E$4893,$B56)","v":0},{"$f":"SUMIF('Etapa 1'!$C$6:$C$90,$B56,'Etapa 1'!$E$6:$E$90)","v":0},{"$f":"SUMIF('Año 3 E1'!$C$6:$C$90,$B56,'Año 3 E1'!$E$6:$E$90)","v":0},{"$f":"SUMIF('Etapa 2'!$C$6:$C$90,$B56,'Etapa 2'!$E$6:$E$90)","v":0},{"$f":"SUMIF('Etapa 3'!$C$6:$C$90,$B56,'Etapa 3'!$E$6:$E$90)","v":0},{"$f":"SUMIFS('Año 1 E1'!$F$9:$F$4893,'Año 1 E1'!$B$9:$B$4893,\"Operaciones\",'Año 1 E1'!$E$9:$E$4893,$B56)","v":0},{"$f":"SUMIF('Etapa 1'!$C$6:$C$90,$B56,'Etapa 1'!$G$6:$G$90)","v":0},{"$f":"SUMIF('Año 3 E1'!$C$6:$C$90,$B56,'Año 3 E1'!$G$6:$G$90)","v":0},{"$f":"SUMIF('Etapa 2'!$C$6:$C$90,$B56,'Etapa 2'!$G$6:$G$90)","v":0},{"$f":"SUMIF('Etapa 3'!$C$6:$C$90,$B56,'Etapa 3'!$G$6:$G$90)","v":0},{"$f":"SUMIFS('Año 1 E1'!$G$9:$G$4893,'Año 1 E1'!$B$9:$B$4893,\"Operaciones\",'Año 1 E1'!$E$9:$E$4893,$B56)","v":0},{"$f":"SUMIF('Etapa 1'!$C$6:$C$90,$B56,'Etapa 1'!$H$6:$H$90)","v":0},{"$f":"SUMIF('Año 3 E1'!$C$6:$C$90,$B56,'Año 3 E1'!$H$6:$H$90)","v":0},{"$f":"SUMIF('Etapa 2'!$C$6:$C$90,$B56,'Etapa 2'!$H$6:$H$90)","v":0},{"$f":"SUMIF('Etapa 3'!$C$6:$C$90,$B56,'Etapa 3'!$H$6:$H$90)","v":0},{"$f":"SUMIFS('Año 1 E1'!$F$9:$F$4893,'Año 1 E1'!$B$9:$B$4893,\"Inversiones\",'Año 1 E1'!$E$9:$E$4893,$B56)","v":0},{"$f":"SUMIF('Etapa 1'!$C$6:$C$90,$B56,'Etapa 1'!$J$6:$J$90)","v":0},{"$f":"SUMIF('Año 3 E1'!$C$6:$C$90,$B56,'Año 3 E1'!$J$6:$J$90)","v":0},{"$f":"SUMIF('Etapa 2'!$C$6:$C$90,$B56,'Etapa 2'!$J$6:$J$90)","v":0},{"$f":"SUMIF('Etapa 3'!$C$6:$C$90,$B56,'Etapa 3'!$J$6:$J$90)","v":0},{"$f":"SUMIFS('Año 1 E1'!$G$9:$G$4893,'Año 1 E1'!$B$9:$B$4893,\"Inversiones\",'Año 1 E1'!$E$9:$E$4893,$B56)","v":0},{"$f":"SUMIF('Etapa 1'!$C$6:$C$90,$B56,'Etapa 1'!$K$6:$K$90)","v":0},{"$f":"SUMIF('Año 3 E1'!$C$6:$C$90,$B56,'Año 3 E1'!$K$6:$K$90)","v":0},{"$f":"SUMIF('Etapa 2'!$C$6:$C$90,$B56,'Etapa 2'!$K$6:$K$90)","v":0},{"$f":"SUMIF('Etapa 3'!$C$6:$C$90,$B56,'Etapa 3'!$K$6:$K$90)","v":0},{"$f":"SUMIFS('Año 1 E1'!$F$9:$F$4893,'Año 1 E1'!$B$9:$B$4893,\"Administración\",'Año 1 E1'!$E$9:$E$4893,$B56)","v":0},{"$f":"SUMIF('Etapa 1'!$C$6:$C$90,$B56,'Etapa 1'!$M$6:$M$90)","v":0},{"$f":"SUMIF('Año 3 E1'!$C$6:$C$90,$B56,'Año 3 E1'!$M$6:$M$90)","v":0},{"$f":"SUMIF('Etapa 2'!$C$6:$C$90,$B56,'Etapa 2'!$M$6:$M$90)","v":0},{"$f":"SUMIF('Etapa 3'!$C$6:$C$90,$B56,'Etapa 3'!$M$6:$M$90)","v":0},{"$f":"SUMIFS('Año 1 E1'!$G$9:$G$4893,'Año 1 E1'!$B$9:$B$4893,\"Administración\",'Año 1 E1'!$E$9:$E$4893,$B56)","v":0},{"$f":"SUMIF('Etapa 1'!$C$6:$C$90,$B56,'Etapa 1'!$N$6:$N$90)","v":0},{"$f":"SUMIF('Año 3 E1'!$C$6:$C$90,$B56,'Año 3 E1'!$N$6:$N$90)","v":0},{"$f":"SUMIF('Etapa 2'!$C$6:$C$90,$B56,'Etapa 2'!$N$6:$N$90)","v":0},{"$f":"SUMIF('Etapa 3'!$C$6:$C$90,$B56,'Etapa 3'!$N$6:$N$90)","v":0}]
[null,"Beneficiario",{"$f":"+SUM(W57:AA57)","v":0},{"$f":"+SUM(AB57:AF57)","v":0},{"$f":"+C57+D57","v":0},{"$f":"+SUM(AG57:AK57)","v":0},{"$f":"SUM(AL57:AP57)","v":0},{"$f":"+F57+G57","v":0},{"$f":"+SUM(AQ57:AU57)","v":0},{"$f":"SUM(AV57:AZ57)","v":0},{"$f":"+I57+J57","v":0},{"$f":"+SUM(BA57:BE57)","v":0},{"$f":"SUM(BF57:BJ57)","v":0},{"$f":"+L57+M57","v":0},{"$f":"+C57+F57+I57+L57","v":0},{"$f":"+D57+G57+J57+M57","v":0},{"$f":"+O57+P57","v":0},null,null,null,null,null,{"$f":"SUMIFS('Año 1 E1'!$F$9:$F$4893,'Año 1 E1'!$B$9:$B$4893,\"RRHH\",'Año 1 E1'!$E$9:$E$4893,$B57)","v":0},{"$f":"SUMIF('Etapa 1'!$C$6:$C$90,$B57,'Etapa 1'!$D$6:$D$90)","v":0},{"$f":"SUMIF('Año 3 E1'!$C$6:$C$90,$B57,'Año 3 E1'!$D$6:$D$90)","v":0},{"$f":"SUMIF('Etapa 2'!$C$6:$C$90,$B57,'Etapa 2'!$D$6:$D$90)","v":0},{"$f":"SUMIF('Etapa 3'!$C$6:$C$90,$B57,'Etapa 3'!$D$6:$D$90)","v":0},{"$f":"SUMIFS('Año 1 E1'!$G$9:$G$4893,'Año 1 E1'!$B$9:$B$4893,\"RRHH\",'Año 1 E1'!$E$9:$E$4893,$B57)","v":0},{"$f":"SUMIF('Etapa 1'!$C$6:$C$90,$B57,'Etapa 1'!$E$6:$E$90)","v":0},{"$f":"SUMIF('Año 3 E1'!$C$6:$C$90,$B57,'Año 3 E1'!$E$6:$E$90)","v":0},{"$f":"SUMIF('Etapa 2'!$C$6:$C$90,$B57,'Etapa 2'!$E$6:$E$90)","v":0},{"$f":"SUMIF('Etapa 3'!$C$6:$C$90,$B57,'Etapa 3'!$E$6:$E$90)","v":0},{"$f":"SUMIFS('Año 1 E1'!$F$9:$F$4893,'Año 1 E1'!$B$9:$B$4893,\"Operaciones\",'Año 1 E1'!$E$9:$E$4893,$B57)","v":0},{"$f":"SUMIF('Etapa 1'!$C$6:$C$90,$B57,'Etapa 1'!$G$6:$G$90)","v":0},{"$f":"SUMIF('Año 3 E1'!$C$6:$C$90,$B57,'Año 3 E1'!$G$6:$G$90)","v":0},{"$f":"SUMIF('Etapa 2'!$C$6:$C$90,$B57,'Etapa 2'!$G$6:$G$90)","v":0},{"$f":"SUMIF('Etapa 3'!$C$6:$C$90,$B57,'Etapa 3'!$G$6:$G$90)","v":0},{"$f":"SUMIFS('Año 1 E1'!$G$9:$G$4893,'Año 1 E1'!$B$9:$B$4893,\"Operaciones\",'Año 1 E1'!$E$9:$E$4893,$B57)","v":0},{"$f":"SUMIF('Etapa 1'!$C$6:$C$90,$B57,'Etapa 1'!$H$6:$H$90)","v":0},{"$f":"SUMIF('Año 3 E1'!$C$6:$C$90,$B57,'Año 3 E1'!$H$6:$H$90)","v":0},{"$f":"SUMIF('Etapa 2'!$C$6:$C$90,$B57,'Etapa 2'!$H$6:$H$90)","v":0},{"$f":"SUMIF('Etapa 3'!$C$6:$C$90,$B57,'Etapa 3'!$H$6:$H$90)","v":0},{"$f":"SUMIFS('Año 1 E1'!$F$9:$F$4893,'Año 1 E1'!$B$9:$B$4893,\"Inversiones\",'Año 1 E1'!$E$9:$E$4893,$B57)","v":0},{"$f":"SUMIF('Etapa 1'!$C$6:$C$90,$B57,'Etapa 1'!$J$6:$J$90)","v":0},{"$f":"SUMIF('Año 3 E1'!$C$6:$C$90,$B57,'Año 3 E1'!$J$6:$J$90)","v":0},{"$f":"SUMIF('Etapa 2'!$C$6:$C$90,$B57,'Etapa 2'!$J$6:$J$90)","v":0},{"$f":"SUMIF('Etapa 3'!$C$6:$C$90,$B57,'Etapa 3'!$J$6:$J$90)","v":0},{"$f":"SUMIFS('Año 1 E1'!$G$9:$G$4893,'Año 1 E1'!$B$9:$B$4893,\"Inversiones\",'Año 1 E1'!$E$9:$E$4893,$B57)","v":0},{"$f":"SUMIF('Etapa 1'!$C$6:$C$90,$B57,'Etapa 1'!$K$6:$K$90)","v":0},{"$f":"SUMIF('Año 3 E1'!$C$6:$C$90,$B57,'Año 3 E1'!$K$6:$K$90)","v":0},{"$f":"SUMIF('Etapa 2'!$C$6:$C$90,$B57,'Etapa 2'!$K$6:$K$90)","v":0},{"$f":"SUMIF('Etapa 3'!$C$6:$C$90,$B57,'Etapa 3'!$K$6:$K$90)","v":0},{"$f":"SUMIFS('Año 1 E1'!$F$9:$F$4893,'Año 1 E1'!$B$9:$B$4893,\"Administración\",'Año 1 E1'!$E$9:$E$4893,$B57)","v":0},{"$f":"SUMIF('Etapa 1'!$C$6:$C$90,$B57,'Etapa 1'!$M$6:$M$90)","v":0},{"$f":"SUMIF('Año 3 E1'!$C$6:$C$90,$B57,'Año 3 E1'!$M$6:$M$90)","v":0},{"$f":"SUMIF('Etapa 2'!$C$6:$C$90,$B57,'Etapa 2'!$M$6:$M$90)","v":0},{"$f":"SUMIF('Etapa 3'!$C$6:$C$90,$B57,'Etapa 3'!$M$6:$M$90)","v":0},{"$f":"SUMIFS('Año 1 E1'!$G$9:$G$4893,'Año 1 E1'!$B$9:$B$4893,\"Administración\",'Año 1 E1'!$E$9:$E$4893,$B57)","v":0},{"$f":"SUMIF('Etapa 1'!$C$6:$C$90,$B57,'Etapa 1'!$N$6:$N$90)","v":0},{"$f":"SUMIF('Año 3 E1'!$C$6:$C$90,$B57,'Año 3 E1'!$N$6:$N$90)","v":0},{"$f":"SUMIF('Etapa 2'!$C$6:$C$90,$B57,'Etapa 2'!$N$6:$N$90)","v":0},{"$f":"SUMIF('Etapa 3'!$C$6:$C$90,$B57,'Etapa 3'!$N$6:$N$90)","v":0}]
[null,"Beneficiario Mandatario",0,0,0,0,0,0,0,0,0,0,0,0,0,0,0,null,null,null,null,null,{"$f":"SUMIFS('Año 1 E1'!$F$9:$F$4893,'Año 1 E1'!$B$9:$B$4893,\"RRHH\",'Año 1 E1'!$E$9:$E$4893,$B58)","v":0},{"$f":"SUMIF('Etapa 1'!$C$6:$C$90,$B58,'Etapa 1'!$D$6:$D$90)","v":0},{"$f":"SUMIF('Año 3 E1'!$C$6:$C$90,$B58,'Año 3 E1'!$D$6:$D$90)","v":0},{"$f":"SUMIF('Etapa 2'!$C$6:$C$90,$B58,'Etapa 2'!$D$6:$D$90)","v":0},{"$f":"SUMIF('Etapa 3'!$C$6:$C$90,$B58,'Etapa 3'!$D$6:$D$90)","v":0},{"$f":"SUMIFS('Año 1 E1'!$G$9:$G$4893,'Año 1 E1'!$B$9:$B$4893,\"RRHH\",'Año 1 E1'!$E$9:$E$4893,$B58)","v":0},{"$f":"SUMIF('Etapa 1'!$C$6:$C$90,$B58,'Etapa 1'!$E$6:$E$90)","v":0},{"$f":"SUMIF('Año 3 E1'!$C$6:$C$90,$B58,'Año 3 E1'!$E$6:$E$90)","v":0},{"$f":"SUMIF('Etapa 2'!$C$6:$C$90,$B58,'Etapa 2'!$E$6:$E$90)","v":0},{"$f":"SUMIF('Etapa 3'!$C$6:$C$90,$B58,'Etapa 3'!$E$6:$E$90)","v":0},{"$f":"SUMIFS('Año 1 E1'!$F$9:$F$4893,'Año 1 E1'!$B$9:$B$4893,\"Operaciones\",'Año 1 E1'!$E$9:$E$4893,$B58)","v":0},{"$f":"SUMIF('Etapa 1'!$C$6:$C$90,$B58,'Etapa 1'!$G$6:$G$90)","v":0},{"$f":"SUMIF('Año 3 E1'!$C$6:$C$90,$B58,'Año 3 E1'!$G$6:$G$90)","v":0},{"$f":"SUMIF('Etapa 2'!$C$6:$C$90,$B58,'Etapa 2'!$G$6:$G$90)","v":0},{"$f":"SUMIF('Etapa 3'!$C$6:$C$90,$B58,'Etapa 3'!$G$6:$G$90)","v":0},{"$f":"SUMIFS('Año 1 E1'!$G$9:$G$4893,'Año 1 E1'!$B$9:$B$4893,\"Operaciones\",'Año 1 E1'!$E$9:$E$4893,$B58)","v":0},{"$f":"SUMIF('Etapa 1'!$C$6:$C$90,$B58,'Etapa 1'!$H$6:$H$90)","v":0},{"$f":"SUMIF('Año 3 E1'!$C$6:$C$90,$B58,'Año 3 E1'!$H$6:$H$90)","v":0},{"$f":"SUMIF('Etapa 2'!$C$6:$C$90,$B58,'Etapa 2'!$H$6:$H$90)","v":0},{"$f":"SUMIF('Etapa 3'!$C$6:$C$90,$B58,'Etapa 3'!$H$6:$H$90)","v":0},{"$f":"SUMIFS('Año 1 E1'!$F$9:$F$4893,'Año 1 E1'!$B$9:$B$4893,\"Inversiones\",'Año 1 E1'!$E$9:$E$4893,$B58)","v":0},{"$f":"SUMIF('Etapa 1'!$C$6:$C$90,$B58,'Etapa 1'!$J$6:$J$90)","v":0},{"$f":"SUMIF('Año 3 E1'!$C$6:$C$90,$B58,'Año 3 E1'!$J$6:$J$90)","v":0},{"$f":"SUMIF('Etapa 2'!$C$6:$C$90,$B58,'Etapa 2'!$J$6:$J$90)","v":0},{"$f":"SUMIF('Etapa 3'!$C$6:$C$90,$B58,'Etapa 3'!$J$6:$J$90)","v":0},{"$f":"SUMIFS('Año 1 E1'!$G$9:$G$4893,'Año 1 E1'!$B$9:$B$4893,\"Inversiones\",'Año 1 E1'!$E$9:$E$4893,$B58)","v":0},{"$f":"SUMIF('Etapa 1'!$C$6:$C$90,$B58,'Etapa 1'!$K$6:$K$90)","v":0},{"$f":"SUMIF('Año 3 E1'!$C$6:$C$90,$B58,'Año 3 E1'!$K$6:$K$90)","v":0},{"$f":"SUMIF('Etapa 2'!$C$6:$C$90,$B58,'Etapa 2'!$K$6:$K$90)","v":0},{"$f":"SUMIF('Etapa 3'!$C$6:$C$90,$B58,'Etapa 3'!$K$6:$K$90)","v":0},{"$f":"SUMIFS('Año 1 E1'!$F$9:$F$4893,'Año 1 E1'!$B$9:$B$4893,\"Administración\",'Año 1 E1'!$E$9:$E$4893,$B58)","v":0},{"$f":"SUMIF('Etapa 1'!$C$6:$C$90,$B58,'Etapa 1'!$M$6:$M$90)","v":0},{"$f":"SUMIF('Año 3 E1'!$C$6:$C$90,$B58,'Año 3 E1'!$M$6:$M$90)","v":0},{"$f":"SUMIF('Etapa 2'!$C$6:$C$90,$B58,'Etapa 2'!$M$6:$M$90)","v":0},{"$f":"SUMIF('Etapa 3'!$C$6:$C$90,$B58,'Etapa 3'!$M$6:$M$90)","v":0},{"$f":"SUMIFS('Año 1 E1'!$G$9:$G$4893,'Año 1 E1'!$B$9:$B$4893,\"Administración\",'Año 1 E1'!$E$9:$E$4893,$B58)","v":0},{"$f":"SUMIF('Etapa 1'!$C$6:$C$90,$B58,'Etapa 1'!$N$6:$N$90)","v":0},{"$f":"SUMIF('Año 3 E1'!$C$6:$C$90,$B58,'Año 3 E1'!$N$6:$N$90)","v":0},{"$f":"SUMIF('Etapa 2'!$C$6:$C$90,$B58,'Etapa 2'!$N$6:$N$90)","v":0},{"$f":"SUMIF('Etapa 3'!$C$6:$C$90,$B58,'Etapa 3'!$N$6:$N$90)","v":0}]
[null,"Beneficiario Mandante",0,0,0,0,0,0,0,0,0,0,0,0,0,0,0,null,null,null,null,null,{"$f":"SUMIFS('Año 1 E1'!$F$9:$F$4893,'Año 1 E1'!$B$9:$B$4893,\"RRHH\",'Año 1 E1'!$E$9:$E$4893,$B59)","v":0},{"$f":"SUMIF('Etapa 1'!$C$6:$C$90,$B59,'Etapa 1'!$D$6:$D$90)","v":0},{"$f":"SUMIF('Año 3 E1'!$C$6:$C$90,$B59,'Año 3 E1'!$D$6:$D$90)","v":0},{"$f":"SUMIF('Etapa 2'!$C$6:$C$90,$B59,'Etapa 2'!$D$6:$D$90)","v":0},{"$f":"SUMIF('Etapa 3'!$C$6:$C$90,$B59,'Etapa 3'!$D$6:$D$90)","v":0},{"$f":"SUMIFS('Año 1 E1'!$G$9:$G$4893,'Año 1 E1'!$B$9:$B$4893,\"RRHH\",'Año 1 E1'!$E$9:$E$4893,$B59)","v":0},{"$f":"SUMIF('Etapa 1'!$C$6:$C$90,$B59,'Etapa 1'!$E$6:$E$90)","v":0},{"$f":"SUMIF('Año 3 E1'!$C$6:$C$90,$B59,'Año 3 E1'!$E$6:$E$90)","v":0},{"$f":"SUMIF('Etapa 2'!$C$6:$C$90,$B59,'Etapa 2'!$E$6:$E$90)","v":0},{"$f":"SUMIF('Etapa 3'!$C$6:$C$90,$B59,'Etapa 3'!$E$6:$E$90)","v":0},{"$f":"SUMIFS('Año 1 E1'!$F$9:$F$4893,'Año 1 E1'!$B$9:$B$4893,\"Operaciones\",'Año 1 E1'!$E$9:$E$4893,$B59)","v":0},{"$f":"SUMIF('Etapa 1'!$C$6:$C$90,$B59,'Etapa 1'!$G$6:$G$90)","v":0},{"$f":"SUMIF('Año 3 E1'!$C$6:$C$90,$B59,'Año 3 E1'!$G$6:$G$90)","v":0},{"$f":"SUMIF('Etapa 2'!$C$6:$C$90,$B59,'Etapa 2'!$G$6:$G$90)","v":0},{"$f":"SUMIF('Etapa 3'!$C$6:$C$90,$B59,'Etapa 3'!$G$6:$G$90)","v":0},{"$f":"SUMIFS('Año 1 E1'!$G$9:$G$4893,'Año 1 E1'!$B$9:$B$4893,\"Operaciones\",'Año 1 E1'!$E$9:$E$4893,$B59)","v":0},{"$f":"SUMIF('Etapa 1'!$C$6:$C$90,$B59,'Etapa 1'!$H$6:$H$90)","v":0},{"$f":"SUMIF('Año 3 E1'!$C$6:$C$90,$B59,'Año 3 E1'!$H$6:$H$90)","v":0},{"$f":"SUMIF('Etapa 2'!$C$6:$C$90,$B59,'Etapa 2'!$H$6:$H$90)","v":0},{"$f":"SUMIF('Etapa 3'!$C$6:$C$90,$B59,'Etapa 3'!$H$6:$H$90)","v":0},{"$f":"SUMIFS('Año 1 E1'!$F$9:$F$4893,'Año 1 E1'!$B$9:$B$4893,\"Inversiones\",'Año 1 E1'!$E$9:$E$4893,$B59)","v":0},{"$f":"SUMIF('Etapa 1'!$C$6:$C$90,$B59,'Etapa 1'!$J$6:$J$90)","v":0},{"$f":"SUMIF('Año 3 E1'!$C$6:$C$90,$B59,'Año 3 E1'!$J$6:$J$90)","v":0},{"$f":"SUMIF('Etapa 2'!$C$6:$C$90,$B59,'Etapa 2'!$J$6:$J$90)","v":0},{"$f":"SUMIF('Etapa 3'!$C$6:$C$90,$B59,'Etapa 3'!$J$6:$J$90)","v":0},{"$f":"SUMIFS('Año 1 E1'!$G$9:$G$4893,'Año 1 E1'!$B$9:$B$4893,\"Inversiones\",'Año 1 E1'!$E$9:$E$4893,$B59)","v":0},{"$f":"SUMIF('Etapa 1'!$C$6:$C$90,$B59,'Etapa 1'!$K$6:$K$90)","v":0},{"$f":"SUMIF('Año 3 E1'!$C$6:$C$90,$B59,'Año 3 E1'!$K$6:$K$90)","v":0},{"$f":"SUMIF('Etapa 2'!$C$6:$C$90,$B59,'Etapa 2'!$K$6:$K$90)","v":0},{"$f":"SUMIF('Etapa 3'!$C$6:$C$90,$B59,'Etapa 3'!$K$6:$K$90)","v":0},{"$f":"SUMIFS('Año 1 E1'!$F$9:$F$4893,'Año 1 E1'!$B$9:$B$4893,\"Administración\",'Año 1 E1'!$E$9:$E$4893,$B59)","v":0},{"$f":"SUMIF('Etapa 1'!$C$6:$C$90,$B59,'Etapa 1'!$M$6:$M$90)","v":0},{"$f":"SUMIF('Año 3 E1'!$C$6:$C$90,$B59,'Año 3 E1'!$M$6:$M$90)","v":0},{"$f":"SUMIF('Etapa 2'!$C$6:$C$90,$B59,'Etapa 2'!$M$6:$M$90)","v":0},{"$f":"SUMIF('Etapa 3'!$C$6:$C$90,$B59,'Etapa 3'!$M$6:$M$90)","v":0},{"$f":"SUMIFS('Año 1 E1'!$G$9:$G$4893,'Año 1 E1'!$B$9:$B$4893,\"Administración\",'Año 1 E1'!$E$9:$E$4893,$B59)","v":0},{"$f":"SUMIF('Etapa 1'!$C$6:$C$90,$B59,'Etapa 1'!$N$6:$N$90)","v":0},{"$f":"SUMIF('Año 3 E1'!$C$6:$C$90,$B59,'Año 3 E1'!$N$6:$N$90)","v":0},{"$f":"SUMIF('Etapa 2'!$C$6:$C$90,$B59,'Etapa 2'!$N$6:$N$90)","v":0},{"$f":"SUMIF('Etapa 3'!$C$6:$C$90,$B59,'Etapa 3'!$N$6:$N$90)","v":0}]
[null,"Coejecutor",0,0,0,0,0,0,0,0,0,0,0,0,0,0,0,null,null,null,null,null,{"$f":"SUMIFS('Año 1 E1'!$F$9:$F$4893,'Año 1 E1'!$B$9:$B$4893,\"RRHH\",'Año 1 E1'!$E$9:$E$4893,$B60)","v":0},{"$f":"SUMIF('Etapa 1'!$C$6:$C$90,$B60,'Etapa 1'!$D$6:$D$90)","v":0},{"$f":"SUMIF('Año 3 E1'!$C$6:$C$90,$B60,'Año 3 E1'!$D$6:$D$90)","v":0},{"$f":"SUMIF('Etapa 2'!$C$6:$C$90,$B60,'Etapa 2'!$D$6:$D$90)","v":0},{"$f":"SUMIF('Etapa 3'!$C$6:$C$90,$B60,'Etapa 3'!$D$6:$D$90)","v":0},{"$f":"SUMIFS('Año 1 E1'!$G$9:$G$4893,'Año 1 E1'!$B$9:$B$4893,\"RRHH\",'Año 1 E1'!$E$9:$E$4893,$B60)","v":0},{"$f":"SUMIF('Etapa 1'!$C$6:$C$90,$B60,'Etapa 1'!$E$6:$E$90)","v":0},{"$f":"SUMIF('Año 3 E1'!$C$6:$C$90,$B60,'Año 3 E1'!$E$6:$E$90)","v":0},{"$f":"SUMIF('Etapa 2'!$C$6:$C$90,$B60,'Etapa 2'!$E$6:$E$90)","v":0},{"$f":"SUMIF('Etapa 3'!$C$6:$C$90,$B60,'Etapa 3'!$E$6:$E$90)","v":0},{"$f":"SUMIFS('Año 1 E1'!$F$9:$F$4893,'Año 1 E1'!$B$9:$B$4893,\"Operaciones\",'Año 1 E1'!$E$9:$E$4893,$B60)","v":0},{"$f":"SUMIF('Etapa 1'!$C$6:$C$90,$B60,'Etapa 1'!$G$6:$G$90)","v":0},{"$f":"SUMIF('Año 3 E1'!$C$6:$C$90,$B60,'Año 3 E1'!$G$6:$G$90)","v":0},{"$f":"SUMIF('Etapa 2'!$C$6:$C$90,$B60,'Etapa 2'!$G$6:$G$90)","v":0},{"$f":"SUMIF('Etapa 3'!$C$6:$C$90,$B60,'Etapa 3'!$G$6:$G$90)","v":0},{"$f":"SUMIFS('Año 1 E1'!$G$9:$G$4893,'Año 1 E1'!$B$9:$B$4893,\"Operaciones\",'Año 1 E1'!$E$9:$E$4893,$B60)","v":0},{"$f":"SUMIF('Etapa 1'!$C$6:$C$90,$B60,'Etapa 1'!$H$6:$H$90)","v":0},{"$f":"SUMIF('Año 3 E1'!$C$6:$C$90,$B60,'Año 3 E1'!$H$6:$H$90)","v":0},{"$f":"SUMIF('Etapa 2'!$C$6:$C$90,$B60,'Etapa 2'!$H$6:$H$90)","v":0},{"$f":"SUMIF('Etapa 3'!$C$6:$C$90,$B60,'Etapa 3'!$H$6:$H$90)","v":0},{"$f":"SUMIFS('Año 1 E1'!$F$9:$F$4893,'Año 1 E1'!$B$9:$B$4893,\"Inversiones\",'Año 1 E1'!$E$9:$E$4893,$B60)","v":0},{"$f":"SUMIF('Etapa 1'!$C$6:$C$90,$B60,'Etapa 1'!$J$6:$J$90)","v":0},{"$f":"SUMIF('Año 3 E1'!$C$6:$C$90,$B60,'Año 3 E1'!$J$6:$J$90)","v":0},{"$f":"SUMIF('Etapa 2'!$C$6:$C$90,$B60,'Etapa 2'!$J$6:$J$90)","v":0},{"$f":"SUMIF('Etapa 3'!$C$6:$C$90,$B60,'Etapa 3'!$J$6:$J$90)","v":0},{"$f":"SUMIFS('Año 1 E1'!$G$9:$G$4893,'Año 1 E1'!$B$9:$B$4893,\"Inversiones\",'Año 1 E1'!$E$9:$E$4893,$B60)","v":0},{"$f":"SUMIF('Etapa 1'!$C$6:$C$90,$B60,'Etapa 1'!$K$6:$K$90)","v":0},{"$f":"SUMIF('Año 3 E1'!$C$6:$C$90,$B60,'Año 3 E1'!$K$6:$K$90)","v":0},{"$f":"SUMIF('Etapa 2'!$C$6:$C$90,$B60,'Etapa 2'!$K$6:$K$90)","v":0},{"$f":"SUMIF('Etapa 3'!$C$6:$C$90,$B60,'Etapa 3'!$K$6:$K$90)","v":0},{"$f":"SUMIFS('Año 1 E1'!$F$9:$F$4893,'Año 1 E1'!$B$9:$B$4893,\"Administración\",'Año 1 E1'!$E$9:$E$4893,$B60)","v":0},{"$f":"SUMIF('Etapa 1'!$C$6:$C$90,$B60,'Etapa 1'!$M$6:$M$90)","v":0},{"$f":"SUMIF('Año 3 E1'!$C$6:$C$90,$B60,'Año 3 E1'!$M$6:$M$90)","v":0},{"$f":"SUMIF('Etapa 2'!$C$6:$C$90,$B60,'Etapa 2'!$M$6:$M$90)","v":0},{"$f":"SUMIF('Etapa 3'!$C$6:$C$90,$B60,'Etapa 3'!$M$6:$M$90)","v":0},{"$f":"SUMIFS('Año 1 E1'!$G$9:$G$4893,'Año 1 E1'!$B$9:$B$4893,\"Administración\",'Año 1 E1'!$E$9:$E$4893,$B60)","v":0},{"$f":"SUMIF('Etapa 1'!$C$6:$C$90,$B60,'Etapa 1'!$N$6:$N$90)","v":0},{"$f":"SUMIF('Año 3 E1'!$C$6:$C$90,$B60,'Año 3 E1'!$N$6:$N$90)","v":0},{"$f":"SUMIF('Etapa 2'!$C$6:$C$90,$B60,'Etapa 2'!$N$6:$N$90)","v":0},{"$f":"SUMIF('Etapa 3'!$C$6:$C$90,$B60,'Etapa 3'!$N$6:$N$90)","v":0}]
[null,"Asociado",0,0,0,0,0,0,0,0,0,0,0,0,0,0,0,null,null,null,null,null,{"$f":"SUMIFS('Año 1 E1'!$F$9:$F$4893,'Año 1 E1'!$B$9:$B$4893,\"RRHH\",'Año 1 E1'!$E$9:$E$4893,$B61)","v":0},{"$f":"SUMIF('Etapa 1'!$C$6:$C$90,$B61,'Etapa 1'!$D$6:$D$90)","v":0},{"$f":"SUMIF('Año 3 E1'!$C$6:$C$90,$B61,'Año 3 E1'!$D$6:$D$90)","v":0},{"$f":"SUMIF('Etapa 2'!$C$6:$C$90,$B61,'Etapa 2'!$D$6:$D$90)","v":0},{"$f":"SUMIF('Etapa 3'!$C$6:$C$90,$B61,'Etapa 3'!$D$6:$D$90)","v":0},{"$f":"SUMIFS('Año 1 E1'!$G$9:$G$4893,'Año 1 E1'!$B$9:$B$4893,\"RRHH\",'Año 1 E1'!$E$9:$E$4893,$B61)","v":0},{"$f":"SUMIF('Etapa 1'!$C$6:$C$90,$B61,'Etapa 1'!$E$6:$E$90)","v":0},{"$f":"SUMIF('Año 3 E1'!$C$6:$C$90,$B61,'Año 3 E1'!$E$6:$E$90)","v":0},{"$f":"SUMIF('Etapa 2'!$C$6:$C$90,$B61,'Etapa 2'!$E$6:$E$90)","v":0},{"$f":"SUMIF('Etapa 3'!$C$6:$C$90,$B61,'Etapa 3'!$E$6:$E$90)","v":0},{"$f":"SUMIFS('Año 1 E1'!$F$9:$F$4893,'Año 1 E1'!$B$9:$B$4893,\"Operaciones\",'Año 1 E1'!$E$9:$E$4893,$B61)","v":0},{"$f":"SUMIF('Etapa 1'!$C$6:$C$90,$B61,'Etapa 1'!$G$6:$G$90)","v":0},{"$f":"SUMIF('Año 3 E1'!$C$6:$C$90,$B61,'Año 3 E1'!$G$6:$G$90)","v":0},{"$f":"SUMIF('Etapa 2'!$C$6:$C$90,$B61,'Etapa 2'!$G$6:$G$90)","v":0},{"$f":"SUMIF('Etapa 3'!$C$6:$C$90,$B61,'Etapa 3'!$G$6:$G$90)","v":0},{"$f":"SUMIFS('Año 1 E1'!$G$9:$G$4893,'Año 1 E1'!$B$9:$B$4893,\"Operaciones\",'Año 1 E1'!$E$9:$E$4893,$B61)","v":0},{"$f":"SUMIF('Etapa 1'!$C$6:$C$90,$B61,'Etapa 1'!$H$6:$H$90)","v":0},{"$f":"SUMIF('Año 3 E1'!$C$6:$C$90,$B61,'Año 3 E1'!$H$6:$H$90)","v":0},{"$f":"SUMIF('Etapa 2'!$C$6:$C$90,$B61,'Etapa 2'!$H$6:$H$90)","v":0},{"$f":"SUMIF('Etapa 3'!$C$6:$C$90,$B61,'Etapa 3'!$H$6:$H$90)","v":0},{"$f":"SUMIFS('Año 1 E1'!$F$9:$F$4893,'Año 1 E1'!$B$9:$B$4893,\"Inversiones\",'Año 1 E1'!$E$9:$E$4893,$B61)","v":0},{"$f":"SUMIF('Etapa 1'!$C$6:$C$90,$B61,'Etapa 1'!$J$6:$J$90)","v":0},{"$f":"SUMIF('Año 3 E1'!$C$6:$C$90,$B61,'Año 3 E1'!$J$6:$J$90)","v":0},{"$f":"SUMIF('Etapa 2'!$C$6:$C$90,$B61,'Etapa 2'!$J$6:$J$90)","v":0},{"$f":"SUMIF('Etapa 3'!$C$6:$C$90,$B61,'Etapa 3'!$J$6:$J$90)","v":0},{"$f":"SUMIFS('Año 1 E1'!$G$9:$G$4893,'Año 1 E1'!$B$9:$B$4893,\"Inversiones\",'Año 1 E1'!$E$9:$E$4893,$B61)","v":0},{"$f":"SUMIF('Etapa 1'!$C$6:$C$90,$B61,'Etapa 1'!$K$6:$K$90)","v":0},{"$f":"SUMIF('Año 3 E1'!$C$6:$C$90,$B61,'Año 3 E1'!$K$6:$K$90)","v":0},{"$f":"SUMIF('Etapa 2'!$C$6:$C$90,$B61,'Etapa 2'!$K$6:$K$90)","v":0},{"$f":"SUMIF('Etapa 3'!$C$6:$C$90,$B61,'Etapa 3'!$K$6:$K$90)","v":0},{"$f":"SUMIFS('Año 1 E1'!$F$9:$F$4893,'Año 1 E1'!$B$9:$B$4893,\"Administración\",'Año 1 E1'!$E$9:$E$4893,$B61)","v":0},{"$f":"SUMIF('Etapa 1'!$C$6:$C$90,$B61,'Etapa 1'!$M$6:$M$90)","v":0},{"$f":"SUMIF('Año 3 E1'!$C$6:$C$90,$B61,'Año 3 E1'!$M$6:$M$90)","v":0},{"$f":"SUMIF('Etapa 2'!$C$6:$C$90,$B61,'Etapa 2'!$M$6:$M$90)","v":0},{"$f":"SUMIF('Etapa 3'!$C$6:$C$90,$B61,'Etapa 3'!$M$6:$M$90)","v":0},{"$f":"SUMIFS('Año 1 E1'!$G$9:$G$4893,'Año 1 E1'!$B$9:$B$4893,\"Administración\",'Año 1 E1'!$E$9:$E$4893,$B61)","v":0},{"$f":"SUMIF('Etapa 1'!$C$6:$C$90,$B61,'Etapa 1'!$N$6:$N$90)","v":0},{"$f":"SUMIF('Año 3 E1'!$C$6:$C$90,$B61,'Año 3 E1'!$N$6:$N$90)","v":0},{"$f":"SUMIF('Etapa 2'!$C$6:$C$90,$B61,'Etapa 2'!$N$6:$N$90)","v":0},{"$f":"SUMIF('Etapa 3'!$C$6:$C$90,$B61,'Etapa 3'!$N$6:$N$90)","v":0}]
[null,"Total",{"$f":"+SUM(C56:C61)","v":0},0,0,0,0,0,0,0,0,0,0,0,0,0,0,null,null,null,null,null,{"$f":"SUM(W56:W61)","v":0},{"$f":"SUM(X56:X61)","v":0},0,0,0,0,0,0,0,0,0,0,0,0,0,0,0,0,0,0,0,0,0,0,0,0,0,0,0,0,0,0,0,0,0,0,0,0,0,0]
[]
[null,"Distribución porcentual por Cuentas:",null,null,{"$f":"E62/$Q$62","v":{"$error":"#DIV/0!"}},null,null,{"$f":"H62/$Q$62","v":{"$error":"#DIV/0!"}},null,null,{"$f":"K62/$Q$62","v":{"$error":"#DIV/0!"}},null,null,{"$f":"N62/$Q$62","v":{"$error":"#DIV/0!"}}]
[null,"Máximo aporte Corfo Gtos. Adm. (15%)",null,null,null,null,null,null,null,null,null,null,null,{"$f":"+N56/(E56+H56+K56)","v":{"$error":"#DIV/0!"}},{"$f":"IF(N65>0.15,\"Supera máximo\",\"OK\")","v":{"$error":"#DIV/0!"}}]
[]
[]
[]
[]
[null,null,null,null,null,null,null,null,null,null,null,null,null,null,null,null,null,null,null,null,null,null,"act e1"]
[]
[null,null,null,null,null,null,null,null,null,null,null,null,null,null,null,null,null,null,null,null,null,null,{"$f":"SUMIF('Etapa 1 x Act'!B9:B2194,B83,'Etapa 1 x Act'!H9:H2194)","v":0}]

{"sheet":"Listas","index":12,"n_rows":7,"n_cols":3,"rows_kept":7,"cut":false,"hidden":true,"merged":[]}
["Tipo entidad",null,"Cuentas"]
["Corfo",null,"RRHH"]
["Beneficiario",null,"Operaciones"]
["Beneficiario Mandatario",null,"Inversiones"]
["Beneficiario Mandante",null,"Administración"]
["Coejecutor"]
["Asociado"]