{"text_format":"1","workbook":"xlsx","n_sheets":13,"sheets":["Inicio","Participantes","Obj Esp","Actividades","Año 1 E1","Etapa 1","Año 3 E1","Etapa 2","Etapa 3","Etapa 1 x Act","Áreas Desarrollo","Tablas Resumen","Listas"],"not_rendered":{"charts":0,"images":1,"macros":1,"external_links":0,"defined_names":17,"comments":1,"pivot_tables":0},"unopened":[],"bounds":{"document_bytes":16777216,"sheet_cells":100000,"rows_first":2000,"rows_last":500,"rows_between":2000,"halvings":0,"cell_chars":16384,"cell_head_chars":4096},"cells_cut":0,"cells_raw":0,"read":"whole","date_system":"1900"}

{"sheet":"Inicio","index":0,"n_rows":9,"n_cols":2,"rows_kept":9,"cut":false,"hidden":false,"merged":[[8,1,8,7]]}
[null,"Inicio"]
[null,"Presupuesto Centros Tecnológicos para la Innovación - Alcance Nacional"]
[null,"Instrucciones Generales:"]
[null,"1. Habilite las macros del documento. Haga clic en el boton \"Habilitar contenido\". Imagen ejemplo ->"]
[null,"2. Haga clic en las siguientes secciones para comenzar a ingresar el presupuesto del proyecto en Millones de pesos (MM$)."]
[null,"3. Para ingresar el presupuesto relacionado a una Entidad Participante éstas deben estár previamente identificadas."]
[]
[null,"Nombre del Proyecto:"]
[null,"Escriba el nombre del proyecto postulado…"]

{"sheet":"Participantes","index":1,"n_rows":86,"n_cols":6,"rows_kept":86,"cut":false,"hidden":false,"merged":[]}
["Nombre de la Entidad Participante / Fuente de Financiamiento","Tipo",null,null,"Debe hacer clic en el botón \"Ordenar Participantes\" para ordenarlos por TIPO."]
["Corfo","Corfo",{"$f":"IF(A2>0,IF(B2>0,\" \",\"<<<  seleccionar tipo de entidad\"),IF(B2>0,IF(A2>0,\" \",\"<<<  escriba el nombre de la entidad\"),\" \"))","v":" "},null,null,{"$f":"+A2","v":"Corfo"}]
[null,null," ",null,null,0]
[null,null," ",null,null,0]
[null,null," ",null,null,0]
[null,null," ",null,null,0]
[null,null," ",null,null,0]
[null,null," ",null,null,0]
[null,null," ",null,null,0]
[null,null," ",null,null,0]
[null,null," ",null,null,0]
[null,null," ",null,null,0]
[null,null," ",null,null,0]
[null,null," ",null,null,0]
[null,null," ",null,null,0]
{"$rows_left_out":72}
{"sheet":"Obj Esp","index":2,"n_rows":15,"n_cols":4,"rows_kept":15,"cut":false,"hidden":true,"merged":[]}
["Objetivos Específicos del Proyecto"]
["Los objetivos específicos deberán ser los mismos que se indiquen en el formulario de postulación."]
[]
["Nº","Objetivos Específicos","Obj Esp","#"]
["Obj. G. ","Actividad asociada a más de un Objetivo Específico",{"$f":"CONCATENATE(A5,B5)","v":"Obj. G. Actividad asociada a más de un Objetivo Específico"},{"$f":"+A5","v":"Obj. G. "}]
["01. ",null,"01. ",{"$f":"+A6","v":"01. "}]
["02. ",null,"02. ",{"$f":"+A7","v":"02. "}]
["03. ",null,"03. ","03. "]
["04. ",null,"04. ","04. "]
["05. ",null,"05. ","05. "]
["06. ",null,"06. ","06. "]
["07. ",null,"07. ","07. "]
["08. ",null,"08. ","08. "]
["09. ",null,"09. ","09. "]
["10. ",null,"10. ","10. "]
{"$rows_left_out":1}
{"sheet":"Actividades","index":3,"n_rows":2177,"n_cols":4,"rows_kept":2177,"cut":false,"hidden":true,"merged":[]}
["Actividades Etapa 1"]
["1. Las actividades asociadas a cada objetivo específico deben ser las mismas indicadas en la Carta Gantt del proyecto."]
["2. En caso de actividades que exedan el tiempo de duración de la Etapa 1, si bien deberá escribirla en la lista, más adelante solo deberá presupuestar lo correspondiente a la Etapa 1."]
["3. Si la actividad esta relacionada a más de un objetivo específico, en la columna \"A\" seleccione \"Obj. G. Actividad asociada a más de un Objetivo Específico\"."]
[]
["Objetivos Específicos","Actividades","num obj"]
[null,"Nombre de la actividad asociada al objetivo específico 1…",{"$f":"VLOOKUP(A7,matriz_obj,2,FALSE)","v":{"$error":"#N/A"}},{"$f":"IF(B7>0,IF(A7>0,\" \",\"Seleccione el Objetivo Específico Asociado\"),\" \")","v":"Seleccione el Objetivo Específico Asociado"}]
[null,"etc…",{"$error":"#N/A"},"Seleccione el Objetivo Específico Asociado"]
[null,"etc…",{"$error":"#N/A"},"Seleccione el Objetivo Específico Asociado"]
[null,"Nombre de la actividad asociada al objetivo específico 2…",{"$error":"#N/A"},"Seleccione el Objetivo Específico Asociado"]
[null,"etc…",{"$error":"#N/A"},"Seleccione el Objetivo Específico Asociado"]
[null,"etc…",{"$error":"#N/A"},"Seleccione el Objetivo Específico Asociado"]
[null,"etc…",{"$error":"#N/A"},"Seleccione el Objetivo Específico Asociado"]
[null,"etc…",{"$error":"#N/A"},"Seleccione el Objetivo Específico Asociado"]
[null,"Nombre de la actividad asociada al objetivo específico 3…",{"$error":"#N/A"},"Seleccione el Objetivo Específico Asociado"]
{"$rows_left_out":2163}
{"sheet":"Año 1 E1","index":4,"n_rows":4893,"n_cols":8,"rows_kept":4893,"cut":false,"hidden":true,"merged":[[1,1,1,2]]}
[null,"Año 1 - Etapa 1",null,null,"Proyecto:",{"$f":"+Inicio!$B$9","v":"Escriba el nombre del proyecto postulado…"}]
[null,"Puesta en Marcha y Posicionamiento",null,null,"Beneficiario:",{"$f":"VLOOKUP(\"Beneficiario Mandatario\",Participantes!$B$2:$F$86,5,FALSE)","v":{"$error":"#N/A"}}]
[]
[null,"Para el primer año del proyecto se deberá confeccionar un presupuesto detallado de acuedo a la siguiente tabla:"]
[]
[null,null,null,null,null,"MM$","MM$","MM$"]
[null,null,null,null,null,{"$f":"SUBTOTAL(9,F9:F4893)","v":0},0,{"$f":"SUBTOTAL(9,H9:H4893)","v":0}]
[null,"Cuenta","Ítem","Fuente/Nombre Entidad","Tipo Entidad","Pecuniario","Valorizado","Subtotal"]
[null,null,null,"Corfo",{"$f":"IF(D9>0,VLOOKUP(D9,entidades,2,FALSE),\" \")","v":"Corfo"},null,null,{"$f":"+F9+G9","v":0}]
[null,null,null,null," ",null,null,0]
[null,null,null,null," ",null,null,0]
[null,null,null,null," ",null,null,0]
[null,null,null,null," ",null,null,0]
[null,null,null,null," ",null,null,0]
[null,null,null,null," ",null,null,0]
{"$rows_left_out":4879}
{"sheet":"Etapa 1","index":5,"n_rows":90,"n_cols":18,"rows_kept":90,"cut":false,"hidden":false,"merged":[[1,6,1,9],[0,6,0,11]]}
[null,"Etapa 1",null,null,null,"Proyecto:",{"$f":"+Inicio!$B$9","v":"Escriba el nombre del proyecto postulado…"}]
[null,"Puesta en Marcha y Posicionamiento",null,null,null,"Beneficiario:",{"$f":"VLOOKUP(\"Beneficiario Mandatario\",Participantes!$B$2:$F$86,5,FALSE)","v":{"$error":"#N/A"}}]
[null,null,null,"RRHH (MM$)",null,null,"Operaciones (MM$)",null,null,"Inversiones (MM$)",null,null,"Administración (MM$)",null,null,"TOTAL (MM$)"]
[null,null,null,{"$f":"SUBTOTAL(9,D6:D90)","v":0},{"$f":"SUBTOTAL(9,E6:E90)","v":0},0,0,0,0,0,0,0,0,0,0,0,0,0]
[null,"Nombre Entidad","Tipo","Pecuniario","Valorizado","Subtotal","Pecuniario","Valorizado","Subtotal","Pecuniario","Valorizado","Subtotal","Pecuniario","Valorizado","Subtotal","Pecuniario","Valorizado","Subtotal"]
[null,"Corfo",{"$f":"IF(B6>0,(VLOOKUP(B6,entidades,2,FALSE)),\" \")","v":"Corfo"},null,null,{"$f":"+D6+E6","v":0},null,null,{"$f":"+G6+H6","v":0},null,null,{"$f":"+J6+K6","v":0},null,null,{"$f":"+M6+N6","v":0},{"$f":"+D6+G6+J6+M6","v":0},{"$f":"+E6+H6+K6+N6","v":0},{"$f":"+P6+Q6","v":0}]
[null,null," ",null,null,0,null,null,0,null,null,0,null,null,0,0,0,0]
[null,null," ",null,null,0,null,null,0,null,null,0,null,null,0,0,0,0]
[null,null," ",null,null,0,null,null,0,null,null,0,null,null,0,0,0,0]
[null,null," ",null,null,0,null,null,0,null,null,0,null,null,0,0,0,0]
[null,null," ",null,null,0,null,null,0,null,null,0,null,null,0,0,0,0]
[null,null," ",null,null,0,null,null,0,null,null,0,null,null,0,0,0,0]
[null,null," ",null,null,0,null,null,0,null,null,0,null,null,0,0,0,0]
[null,null," ",null,null,0,null,null,0,null,null,0,null,null,0,0,0,0]
[null,null," ",null,null,0,null,null,0,null,null,0,null,null,0,0,0,0]
{"$rows_left_out":76}
{"sheet":"Año 3 E1","index":6,"n_rows":90,"n_cols":18,"rows_kept":90,"cut":false,"hidden":true,"merged":[[0,6,0,11],[1,6,1,9]]}
[null,"Año 3 - Etapa 1",null,null,null,"Proyecto:",{"$f":"+Inicio!$B$9","v":"Escriba el nombre del proyecto postulado…"}]
[null,"Puesta en Marcha y Posicionamiento",null,null,null,"Beneficiario:",{"$f":"VLOOKUP(\"Beneficiario Mandatario\",Participantes!$B$2:$F$86,5,FALSE)","v":{"$error":"#N/A"}}]
[null,null,null,"RRHH (MM$)",null,null,"Operaciones (MM$)",null,null,"Inversiones (MM$)",null,null,"Administración (MM$)",null,null,"TOTAL (MM$)"]
[null,null,null,{"$f":"SUBTOTAL(9,D6:D90)","v":0},{"$f":"SUBTOTAL(9,E6:E90)","v":0},0,0,0,0,0,0,0,0,0,0,0,0,0]
[null,"Nombre Entidad","Tipo","Pecuniario","Valorizado","Subtotal","Pecuniario","Valorizado","Subtotal","Pecuniario","Valorizado","Subtotal","Pecuniario","Valorizado","Subtotal","Pecuniario","Valorizado","Subtotal"]
[null,null,{"$f":"IF(B6>0,(VLOOKUP(B6,entidades,2,FALSE)),\" \")","v":" "},null,null,{"$f":"+D6+E6","v":0},null,null,{"$f":"+G6+H6","v":0},null,null,{"$f":"+J6+K6","v":0},null,null,{"$f":"+M6+N6","v":0},{"$f":"+D6+G6+J6+M6","v":0},{"$f":"+E6+H6+K6+N6","v":0},{"$f":"+P6+Q6","v":0}]
[null,null," ",null,null,0,null,null,0,null,null,0,null,null,0,0,0,0]
[null,null," ",null,null,0,null,null,0,null,null,0,null,null,0,0,0,0]
[null,null," ",null,null,0,null,null,0,null,null,0,null,null,0,0,0,0]
[null,null," ",null,null,0,null,null,0,null,null,0,null,null,0,0,0,0]
[null,null," ",null,null,0,null,null,0,null,null,0,null,null,0,0,0,0]
[null,null," ",null,null,0,null,null,0,null,null,0,null,null,0,0,0,0]
[null,null," ",null,null,0,null,null,0,null,null,0,null,null,0,0,0,0]
[null,null," ",null,null,0,null,null,0,null,null,0,null,null,0,0,0,0]
[null,null," ",null,null,0,null,null,0,null,null,0,null,null,0,0,0,0]
{"$rows_left_out":76}
{"sheet":"Etapa 2","index":7,"n_rows":90,"n_cols":18,"rows_kept":90,"cut":false,"hidden":false,"merged":[[0,6,0,11],[1,6,1,9]]}
[null,"Etapa 2",null,null,null,"Proyecto:",{"$f":"+Inicio!$B$9","v":"Escriba el nombre del proyecto postulado…"}]
[null,"Operación y Transferencia Tecnológica",null,null,null,"Beneficiario:",{"$f":"VLOOKUP(\"Beneficiario Mandatario\",Participantes!$B$2:$F$86,5,FALSE)","v":{"$error":"#N/A"}}]
[null,null,null,"RRHH (MM$)",null,null,"Operaciones (MM$)",null,null,"Inversiones (MM$)",null,null,"Administración (MM$)",null,null,"TOTAL (MM$)"]
[null,null,null,{"$f":"SUBTOTAL(9,D6:D90)","v":0},{"$f":"SUBTOTAL(9,E6:E90)","v":0},0,0,0,0,0,0,0,0,0,0,0,0,0]
[null,"Nombre Entidad","Tipo","Pecuniario","Valorizado","Subtotal","Pecuniario","Valorizado","Subtotal","Pecuniario","Valorizado","Subtotal","Pecuniario","Valorizado","Subtotal","Pecuniario","Valorizado","Subtotal"]
[null,"Corfo",{"$f":"IF(B6>0,(VLOOKUP(B6,entidades,2,FALSE)),\" \")","v":"Corfo"},null,null,{"$f":"+D6+E6","v":0},null,null,{"$f":"+G6+H6","v":0},null,null,{"$f":"+J6+K6","v":0},null,null,{"$f":"+M6+N6","v":0},{"$f":"+D6+G6+J6+M6","v":0},{"$f":"+E6+H6+K6+N6","v":0},{"$f":"+P6+Q6","v":0}]
[null,null," ",null,null,0,null,null,0,null,null,0,null,null,0,0,0,0]
[null,null," ",null,null,0,null,null,0,null,null,0,null,null,0,0,0,0]
[null,null," ",null,null,0,null,null,0,null,null,0,null,null,0,0,0,0]
[null,null," ",null,null,0,null,null,0,null,null,0,null,null,0,0,0,0]
[null,null," ",null,null,0,null,null,0,null,null,0,null,null,0,0,0,0]
[null,null," ",null,null,0,null,null,0,null,null,0,null,null,0,0,0,0]
[null,null," ",null,null,0,null,null,0,null,null,0,null,null,0,0,0,0]
[null,null," ",null,null,0,null,null,0,null,null,0,null,null,0,0,0,0]
[null,null," ",null,null,0,null,null,0,null,null,0,null,null,0,0,0,0]
{"$rows_left_out":76}
{"sheet":"Etapa 3","index":8,"n_rows":90,"n_cols":18,"rows_kept":90,"cut":false,"hidden":false,"merged":[[0,6,0,11],[1,6,1,9]]}
[null,"Etapa 3",null,null,null,"Proyecto:",{"$f":"+Inicio!$B$9","v":"Escriba el nombre del proyecto postulado…"}]
[null,"Consolidación",null,null,null,"Beneficiario:",{"$f":"VLOOKUP(\"Beneficiario Mandatario\",Participantes!$B$2:$F$86,5,FALSE)","v":{"$error":"#N/A"}}]
[null,null,null,"RRHH (MM$)",null,null,"Operaciones (MM$)",null,null,"Inversiones (MM$)",null,null,"Administración (MM$)",null,null,"TOTAL (MM$)"]
[null,null,null,{"$f":"SUM(D6:D90)","v":0},{"$f":"SUM(E6:E90)","v":0},0,0,0,0,0,0,0,0,0,0,0,0,0]
[null,"Nombre Entidad","Tipo","Pecuniario","Valorizado","Subtotal","Pecuniario","Valorizado","Subtotal","Pecuniario","Valorizado","Subtotal","Pecuniario","Valorizado","Subtotal","Pecuniario","Valorizado","Subtotal"]
[null,null,{"$f":"IF(B6>0,(VLOOKUP(B6,entidades,2,FALSE)),\" \")","v":" "},null,null,{"$f":"+D6+E6","v":0},null,null,{"$f":"+G6+H6","v":0},null,null,{"$f":"+J6+K6","v":0},null,null,{"$f":"+M6+N6","v":0},{"$f":"+D6+G6+J6+M6","v":0},{"$f":"+E6+H6+K6+N6","v":0},{"$f":"+P6+Q6","v":0}]
[null,null," ",null,null,0,null,null,0,null,null,0,null,null,0,0,0,0]
[null,null," ",null,null,0,null,null,0,null,null,0,null,null,0,0,0,0]
[null,null," ",null,null,0,null,null,0,null,null,0,null,null,0,0,0,0]
[null,null," ",null,null,0,null,null,0,null,null,0,null,null,0,0,0,0]
[null,null," ",null,null,0,null,null,0,null,null,0,null,null,0,0,0,0]
[null,null," ",null,null,0,null,null,0,null,null,0,null,null,0,0,0,0]
[null,null," ",null,null,0,null,null,0,null,null,0,null,null,0,0,0,0]
[null,null," ",null,null,0,null,null,0,null,null,0,null,null,0,0,0,0]
[null,null," ",null,null,0,null,null,0,null,null,0,null,null,0,0,0,0]
{"$rows_left_out":76}
{"sheet":"Etapa 1 x Act","index":9,"n_rows":2194,"n_cols":9,"rows_kept":2194,"cut":false,"hidden":true,"merged":[[1,1,1,2]]}
[null,"Etapa 1, por Objetivos Específicos y Actividades",null,null,"Proyecto:",{"$f":"+Inicio!$B$9","v":"Escriba el nombre del proyecto postulado…"}]
[null,"Puesta en Marcha y Posicionamiento",null,null,"Beneficiario:",{"$f":"VLOOKUP(\"Beneficiario Mandatario\",Participantes!$B$2:$F$86,5,FALSE)","v":{"$error":"#N/A"}}]
[]
[null,"Adicionalmente deberá confeccionar un presupeusto para la Etapa 1 a nivel de Objetivos Específicos y sus Actividades asociadas."]
[null,"El presupuesto total debe cuadrar con el presupuesto total por cuentas."]
[null,null,null,null,null,"MM$","MM$","MM$"]
[null,null,null,null,null,{"$f":"SUBTOTAL(9,F9:F4893)","v":0},{"$f":"SUBTOTAL(9,G9:G4893)","v":0},{"$f":"SUBTOTAL(9,H9:H4893)","v":0},{"$f":"IF(H7='Tablas Resumen'!E28,\"Presupuesto cuadrado\",\"Presupuesto total no cuadra con el total del presupuesto por cuentas del proyecto\")","v":"Presupuesto cuadrado"}]
[null,"Objetivo Específico","Actividad","Fuente/Nombre Entidad","Tipo Entidad","Pecuniario","Valorizado","Subtotal"]
[null,null,null,null,{"$f":"IF(D9>0,VLOOKUP(D9,entidades,2,FALSE),\" \")","v":" "},null,null,{"$f":"+F9+G9","v":0}]
[null,null,null,null," ",null,null,0]
[null,null,null,null," ",null,null,0]
[null,null,null,null," ",null,null,0]
[null,null,null,null," ",null,null,0]
[null,null,null,null," ",null,null,0]
[null,null,null,null," ",null,null,0]
{"$rows_left_out":2180}
{"sheet":"Áreas Desarrollo","index":10,"n_rows":25,"n_cols":15,"rows_kept":25,"cut":false,"hidden":true,"merged":[[1,1,1,10]]}
[null,"Presupuesto por Área de Desarrollo y/o Servicios Tecnológicos",null,null,null,null,null,null,null,null,null,null,"Proyecto:",{"$f":"+Inicio!$B$9","v":"Escriba el nombre del proyecto postulado…"}]
[null,"Confeccione un presupuesto estimativo por Área de Desarrollo y/o Servicios Tecnológicos del proyecto.\nEl presupuesto relacionado con la gestión transversal del proyecto deberá ser ingresado en la columna “Gestión del Proyecto”.\nDe ser necesario deberá prorratear el presupuesto entre más de una Área de Desarrollo y/o Servicios Tecnológicos",null,null,null,null,null,null,null,null,null,null,"Beneficiario:",{"$f":"VLOOKUP(\"Beneficiario Mandatario\",Participantes!$B$2:$F$86,5,FALSE)","v":{"$error":"#N/A"}}]
[]
[null,"Valores en Millones de pesos (MM$)"]
[null,"Entidad Participante","Gestión del Proyecto","Área (1)","Área (2)","Área (3)","Área (4)","Área (5)","Área (6)","Área (7)","Área (8)","Área (9)","Área (10)","Total"]
[null,"Corfo",null,null,null,null,null,null,null,null,null,null,null,{"$f":"+SUM(C6:M6)","v":0},{"$f":"IF(N6='Tablas Resumen'!E8,\"OK\",\"Monto total no cuadra con el total del proyecto por cuentas\")","v":"OK"}]
[null,"Beneficiario",null,null,null,null,null,null,null,null,null,null,null,{"$f":"+SUM(C7:M7)","v":0},{"$f":"IF(N7='Tablas Resumen'!E9,\"OK\",\"Monto total no cuadra con el total del proyecto por cuentas\")","v":"OK"}]
[null,"Beneficiario Mandatario",null,null,null,null,null,null,null,null,null,null,null,0,{"$f":"IF(N8='Tablas Resumen'!E10,\"OK\",\"Monto total no cuadra con el total del proyecto por cuentas\")","v":"OK"}]
[null,"Beneficiario Mandante",null,null,null,null,null,null,null,null,null,null,null,0,{"$f":"IF(N9='Tablas Resumen'!E11,\"OK\",\"Monto total no cuadra con el total del proyecto por cuentas\")","v":"OK"}]
[null,"Coejecutor",null,null,null,null,null,null,null,null,null,null,null,0,{"$f":"IF(N10='Tablas Resumen'!E12,\"OK\",\"Monto total no cuadra con el total del proyecto por cuentas\")","v":"OK"}]
[null,"Asociado",null,null,null,null,null,null,null,null,null,null,null,0,{"$f":"IF(N11='Tablas Resumen'!E13,\"OK\",\"Monto total no cuadra con el total del proyecto por cuentas\")","v":"OK"}]
[null,"Total",{"$f":"SUM(C6:C11)","v":0},{"$f":"SUM(D6:D11)","v":0},0,0,0,0,0,0,0,0,0,0,{"$f":"IF(N12='Tablas Resumen'!E14,\"OK\",\"Monto total no cuadra con el total del proyecto por cuentas\")","v":"OK"}]
[]
[]
[null,"Área de Desarrollo y/o Servicios Tecnológicos:"]
{"$rows_left_out":11}
{"sheet":"Tablas Resumen","index":11,"n_rows":72,"n_cols":62,"rows_kept":72,"cut":false,"hidden":false,"merged":[]}
[null,"Resumen Presupuesto",null,null,null,null,"Proyecto:",{"$f":"+Inicio!$B$9","v":"Escriba el nombre del proyecto postulado…"}]
[null,"Revise todas las tablas y haga los ajustes necesarios.",null,null,null,null,"Beneficiario:",{"$f":"VLOOKUP(\"Beneficiario Mandatario\",Participantes!$B$2:$F$86,5,FALSE)","v":{"$error":"#N/A"}}]
[]
[]
[null,"Presupuesto General"]
[null,"Valores en Millones de pesos (MM$)",null,null,null,null,null,null,null,null,null,null,null,null,null,null,null,null,null,null,null,null,"pecuniario",null,null,null,null,"valorizado"]
[null,"Entidad Participante","Pecuniario","Valorizado","Total",null,null,null,null,null,null,null,null,null,null,null,null,null,null,null,null,null,"a1","a2","a3","e2","e3","a1","a2","a3","e2","e3"]
[null,"Corfo",{"$f":"+SUM(W8:AA8)","v":0},{"$f":"SUM(AB8:AF8)","v":0},{"$f":"+C8+D8","v":0},{"$f":"+IF(E8>N30,\"Supera máximo aporte Corfo para el proyecto\",\"Sin alertas\")","v":"Sin alertas"},null,null,null,null,null,null,null,null,null,null,null,null,null,null,null,null,{"$f":"SUMIF('Año 1 E1'!$E$9:$E$4893,$B8,'Año 1 E1'!$F$9:$F$4893)","v":0},{"$f":"SUMIF('Etapa 1'!$C$6:$C$90,$B8,'Etapa 1'!$P$6:$P$90)","v":0},{"$f":"SUMIF('Año 3 E1'!$C$6:$C$90,$B8,'Año 3 E1'!$P$6:$P$90)","v":0},{"$f":"SUMIF('Etapa 2'!$C$6:$C$90,$B8,'Etapa 2'!$P$6:$P$90)","v":0},{"$f":"SUMIF('Etapa 3'!$C$6:$C$90,$B8,'Etapa 3'!$P$6:$P$90)","v":0},{"$f":"SUMIF('Año 1 E1'!$E$9:$E$4893,$B8,'Año 1 E1'!$G$9:$G$4893)","v":0},{"$f":"SUMIF('Etapa 1'!$C$6:$C$90,$B8,'Etapa 1'!$Q$6:$Q$90)","v":0},{"$f":"SUMIF('Año 3 E1'!$C$6:$C$90,$B8,'Año 3 E1'!$Q$6:$Q$90)","v":0},{"$f":"SUMIF('Etapa 2'!$C$6:$C$90,$B8,'Etapa 2'!$Q$6:$Q$90)","v":0},{"$f":"SUMIF('Etapa 3'!$C$6:$C$90,$B8,'Etapa 3'!$Q$6:$Q$90)","v":0}]
[null,"Beneficiario",{"$f":"+SUM(W9:AA9)","v":0},{"$f":"SUM(AB9:AF9)","v":0},{"$f":"+C9+D9","v":0},"En caso de postulacion Individual",null,null,null,null,null,null,null,null,null,null,null,null,null,null,null,null,{"$f":"SUMIF('Año 1 E1'!$E$9:$E$4893,$B9,'Año 1 E1'!$F$9:$F$4893)","v":0},{"$f":"SUMIF('Etapa 1'!$C$6:$C$90,$B9,'Etapa 1'!$P$6:$P$90)","v":0},{"$f":"SUMIF('Año 3 E1'!$C$6:$C$90,$B9,'Año 3 E1'!$P$6:$P$90)","v":0},{"$f":"SUMIF('Etapa 2'!$C$6:$C$90,$B9,'Etapa 2'!$P$6:$P$90)","v":0},{"$f":"SUMIF('Etapa 3'!$C$6:$C$90,$B9,'Etapa 3'!$P$6:$P$90)","v":0},{"$f":"SUMIF('Año 1 E1'!$E$9:$E$4893,$B9,'Año 1 E1'!$G$9:$G$4893)","v":0},{"$f":"SUMIF('Etapa 1'!$C$6:$C$90,$B9,'Etapa 1'!$Q$6:$Q$90)","v":0},{"$f":"SUMIF('Año 3 E1'!$C$6:$C$90,$B9,'Año 3 E1'!$Q$6:$Q$90)","v":0},{"$f":"SUMIF('Etapa 2'!$C$6:$C$90,$B9,'Etapa 2'!$Q$6:$Q$90)","v":0},{"$f":"SUMIF('Etapa 3'!$C$6:$C$90,$B9,'Etapa 3'!$Q$6:$Q$90)","v":0}]
[null,"Beneficiario Mandatario",0,0,0,"En caso de postulación Conjunta",null,null,null,null,null,null,null,null,null,null,null,null,null,null,null,null,{"$f":"SUMIF('Año 1 E1'!$E$9:$E$4893,$B10,'Año 1 E1'!$F$9:$F$4893)","v":0},{"$f":"SUMIF('Etapa 1'!$C$6:$C$90,$B10,'Etapa 1'!$P$6:$P$90)","v":0},{"$f":"SUMIF('Año 3 E1'!$C$6:$C$90,$B10,'Año 3 E1'!$P$6:$P$90)","v":0},{"$f":"SUMIF('Etapa 2'!$C$6:$C$90,$B10,'Etapa 2'!$P$6:$P$90)","v":0},{"$f":"SUMIF('Etapa 3'!$C$6:$C$90,$B10,'Etapa 3'!$P$6:$P$90)","v":0},{"$f":"SUMIF('Año 1 E1'!$E$9:$E$4893,$B10,'Año 1 E1'!$G$9:$G$4893)","v":0},{"$f":"SUMIF('Etapa 1'!$C$6:$C$90,$B10,'Etapa 1'!$Q$6:$Q$90)","v":0},{"$f":"SUMIF('Año 3 E1'!$C$6:$C$90,$B10,'Año 3 E1'!$Q$6:$Q$90)","v":0},{"$f":"SUMIF('Etapa 2'!$C$6:$C$90,$B10,'Etapa 2'!$Q$6:$Q$90)","v":0},{"$f":"SUMIF('Etapa 3'!$C$6:$C$90,$B10,'Etapa 3'!$Q$6:$Q$90)","v":0}]
[null,"Beneficiario Mandante",0,0,0,"En caso de postulación Conjunta",null,null,null,null,null,null,null,null,null,null,null,null,null,null,null,null,{"$f":"SUMIF('Año 1 E1'!$E$9:$E$4893,$B11,'Año 1 E1'!$F$9:$F$4893)","v":0},{"$f":"SUMIF('Etapa 1'!$C$6:$C$90,$B11,'Etapa 1'!$P$6:$P$90)","v":0},{"$f":"SUMIF('Año 3 E1'!$C$6:$C$90,$B11,'Año 3 E1'!$P$6:$P$90)","v":0},{"$f":"SUMIF('Etapa 2'!$C$6:$C$90,$B11,'Etapa 2'!$P$6:$P$90)","v":0},{"$f":"SUMIF('Etapa 3'!$C$6:$C$90,$B11,'Etapa 3'!$P$6:$P$90)","v":0},{"$f":"SUMIF('Año 1 E1'!$E$9:$E$4893,$B11,'Año 1 E1'!$G$9:$G$4893)","v":0},{"$f":"SUMIF('Etapa 1'!$C$6:$C$90,$B11,'Etapa 1'!$Q$6:$Q$90)","v":0},{"$f":"SUMIF('Año 3 E1'!$C$6:$C$90,$B11,'Año 3 E1'!$Q$6:$Q$90)","v":0},{"$f":"SUMIF('Etapa 2'!$C$6:$C$90,$B11,'Etapa 2'!$Q$6:$Q$90)","v":0},{"$f":"SUMIF('Etapa 3'!$C$6:$C$90,$B11,'Etapa 3'!$Q$6:$Q$90)","v":0}]
[null,"Coejecutor",0,0,0,null,null,null,null,null,null,null,null,null,null,null,null,null,null,null,null,null,{"$f":"SUMIF('Año 1 E1'!$E$9:$E$4893,$B12,'Año 1 E1'!$F$9:$F$4893)","v":0},{"$f":"SUMIF('Etapa 1'!$C$6:$C$90,$B12,'Etapa 1'!$P$6:$P$90)","v":0},{"$f":"SUMIF('Año 3 E1'!$C$6:$C$90,$B12,'Año 3 E1'!$P$6:$P$90)","v":0},{"$f":"SUMIF('Etapa 2'!$C$6:$C$90,$B12,'Etapa 2'!$P$6:$P$90)","v":0},{"$f":"SUMIF('Etapa 3'!$C$6:$C$90,$B12,'Etapa 3'!$P$6:$P$90)","v":0},{"$f":"SUMIF('Año 1 E1'!$E$9:$E$4893,$B12,'Año 1 E1'!$G$9:$G$4893)","v":0},{"$f":"SUMIF('Etapa 1'!$C$6:$C$90,$B12,'Etapa 1'!$Q$6:$Q$90)","v":0},{"$f":"SUMIF('Año 3 E1'!$C$6:$C$90,$B12,'Año 3 E1'!$Q$6:$Q$90)","v":0},{"$f":"SUMIF('Etapa 2'!$C$6:$C$90,$B12,'Etapa 2'!$Q$6:$Q$90)","v":0},{"$f":"SUMIF('Etapa 3'!$C$6:$C$90,$B12,'Etapa 3'!$Q$6:$Q$90)","v":0}]
[null,"Asociado",0,0,0,{"$f":"IF(E13>0,IF(C13>0,\"Sin alertas\",\"Asociados al proyecto deberán aportar con recursos pecuniarios\"),\" \")","v":" "},null,null,null,null,null,null,null,null,null,null,null,null,null,null,null,null,{"$f":"SUMIF('Año 1 E1'!$E$9:$E$4893,$B13,'Año 1 E1'!$F$9:$F$4893)","v":0},{"$f":"SUMIF('Etapa 1'!$C$6:$C$90,$B13,'Etapa 1'!$P$6:$P$90)","v":0},{"$f":"SUMIF('Año 3 E1'!$C$6:$C$90,$B13,'Año 3 E1'!$P$6:$P$90)","v":0},{"$f":"SUMIF('Etapa 2'!$C$6:$C$90,$B13,'Etapa 2'!$P$6:$P$90)","v":0},{"$f":"SUMIF('Etapa 3'!$C$6:$C$90,$B13,'Etapa 3'!$P$6:$P$90)","v":0},{"$f":"SUMIF('Año 1 E1'!$E$9:$E$4893,$B13,'Año 1 E1'!$G$9:$G$4893)","v":0},{"$f":"SUMIF('Etapa 1'!$C$6:$C$90,$B13,'Etapa 1'!$Q$6:$Q$90)","v":0},{"$f":"SUMIF('Año 3 E1'!$C$6:$C$90,$B13,'Año 3 E1'!$Q$6:$Q$90)","v":0},{"$f":"SUMIF('Etapa 2'!$C$6:$C$90,$B13,'Etapa 2'!$Q$6:$Q$90)","v":0},{"$f":"SUMIF('Etapa 3'!$C$6:$C$90,$B13,'Etapa 3'!$Q$6:$Q$90)","v":0}]
[null,"Total",{"$f":"SUM(C8:C13)","v":0},0,{"$f":"SUM(E8:E13)","v":0}]
[]
{"$rows_left_out":58}
{"sheet":"Listas","index":12,"n_rows":7,"n_cols":3,"rows_kept":7,"cut":false,"hidden":true,"merged":[]}
["Tipo entidad",null,"Cuentas"]
["Corfo",null,"RRHH"]
["Beneficiario",null,"Operaciones"]
["Beneficiario Mandatario",null,"Inversiones"]
["Beneficiario Mandante",null,"Administración"]
["Coejecutor"]
["Asociado"]